program: Orca
programVersion: 4.2.1
elementType: Cl Cl O O N N N C C C C C C C C C C C C C C C H H H H H H H H H H H H H H H H H
charge: 0
multiplicity: 1
keywords: wb97x-d3
keywords: def2-TZVPP
keywords: def2/J RIJCOSX GRIDX6 NOFINALGRIDX
keywords: grid4 nofinalgrid
keywords: scfconv7
keywords: smallprint printgap noloewdin
keywords: NOSOSCF
formula: C15H17Cl2N3O2
InChI: InChI=1/C15H17Cl2N3O2/c1-2-3-12-7-21-15(22-12,8-20-10-18-9-19-20)13-5-4-11(16)6-14(13)17/h4-6,9-10,12H,2-3,7-8H2,1H3
39 atoms
Cl 2.541084 -0.718219 -1.516257
Cl 0.576191 -5.456255 -0.084961
O  -1.128728 0.930253 0.526687
O  0.297136 1.168226 -1.172757
N  1.096662 2.585435 1.123989
N  1.923828 3.366445 0.423615
N  0.420959 4.611033 1.528498
C  0.149386 0.576813 0.072152
C  -1.920663 1.364863 -0.575419
C  -0.977729 1.175357 -1.76521
C  -3.210025 0.57418 -0.681712
C  1.180598 1.154976 1.046676
C  0.281887 -0.945905 0.008603
C  -4.111724 0.651896 0.547073
C  1.309325 -1.592333 -0.678601
C  -0.632762 -1.74799 0.684814
C  -4.606227 2.055337 0.870913
C  1.401649 -2.976451 -0.712501
C  -0.558302 -3.129626 0.669805
C  0.200558 3.345689 1.772981
C  0.462581 -3.73711 -0.039659
C  1.484966 4.568889 0.697086
H  -2.137797 2.428941 -0.430592
H  -1.18077 0.233248 -2.292442
H  -1.022611 1.990918 -2.486034
H  -2.968894 -0.472034 -0.894962
H  -3.756529 0.946591 -1.555561
H  2.19119 0.89801 0.737077
H  1.008793 0.721866 2.033242
H  -3.587469 0.238863 1.412658
H  -4.9713 -0.001467 0.379056
H  -1.432321 -1.278122 1.239579
H  -3.793225 2.725966 1.150459
H  -5.123001 2.501129 0.019277
H  -5.307219 2.038829 1.704988
H  2.202999 -3.451435 -1.260159
H  -1.286874 -3.72373 1.202925
H  -0.571947 2.939157 2.406296
H  1.951933 5.450696 0.287459
totalener: -1817.01731542 hartree
nucrepener: 2170.88463002 hartree
electener: -3987.90194544 hartree
oneelecener: -6806.83394491 hartree
twoeener: 2818.93199948 hartree
kineticenergy: 1811.92342712 hartree
xcener: -128.815723147727 hartree
chargesum: 0.0000000
charge: -0.040910 -0.063749 -0.379356 -0.309747 0.113617 -0.293384 -0.337720 0.558656 0.102601 0.024043 -0.197675 -0.116453 -0.128687 -0.090041 -0.016891 -0.163137 -0.265205 -0.155709 -0.164705 0.027607 0.111845 0.055546 0.096243 0.072618 0.098475 0.075189 0.087209 0.132103 0.127503 0.060158 0.072371 0.146912 0.081558 0.078909 0.090398 0.113720 0.124666 0.141364 0.130060
qa: -0.0409 -0.0637 -0.3794 -0.3097 0.1136 -0.2934 -0.3377 0.5587 0.1026 0.0240 -0.1977 -0.1165 -0.1287 -0.0900 -0.0169 -0.1631 -0.2652 -0.1557 -0.1647 0.0276 0.1118 0.0555 0.0962 0.0726 0.0985 0.0752 0.0872 0.1321 0.1275 0.0602 0.0724 0.1469 0.0816 0.0789 0.0904 0.1137 0.1247 0.1414 0.1301
va: 1.2829 1.2417 1.9748 2.0492 3.3605 2.8785 3.0550 3.9048 3.8815 3.9641 3.9563 3.7974 3.5429 3.8702 4.0547 3.9536 3.9412 4.0748 4.0703 4.0802 3.9201 4.0570 0.9923 1.0034 0.9963 1.0119 1.0122 1.0360 1.0038 1.0173 1.0079 1.0149 1.0015 1.0028 1.0061 1.0292 1.0146 1.0093 1.0013
dispcorr: -0.022238921 hartree
energy: -1817.039554338359
dipole: -32.14940 30.88124 -1.26816 21.95907 -22.97294 -1.01387 5.47933 -5.53436 -0.05504
magnitude: 1.62456 au
magnitude: 4.12931 debye
