program: Orca
programVersion: 4.2.1
elementType: Cl Cl O O N N N C C C C C C C C C C C C C C C H H H H H H H H H H H H H H H H H
charge: 0
multiplicity: 1
keywords: wb97x-d3
keywords: def2-TZVPP
keywords: def2/J RIJCOSX GRIDX6 NOFINALGRIDX
keywords: grid4 nofinalgrid
keywords: scfconv7
keywords: smallprint printgap noloewdin
keywords: NOSOSCF
formula: C15H17Cl2N3O2
InChI: InChI=1/C15H17Cl2N3O2/c1-2-3-12-7-21-15(22-12,8-20-10-18-9-19-20)13-5-4-11(16)6-14(13)17/h4-6,9-10,12H,2-3,7-8H2,1H3
39 atoms
Cl 1.212102 -0.080638 -3.015007
Cl 2.562976 -4.421911 -0.241783
O  -1.527501 0.706233 0.450491
O  -1.289325 0.864303 -1.777735
N  0.929169 1.991525 0.904316
N  0.314448 2.644573 1.895606
N  2.16538 1.63516 2.656485
C  -0.587411 0.717783 -0.570022
C  -2.663689 1.417428 -0.007437
C  -2.660537 1.045788 -1.483931
C  -3.887216 1.000784 0.777055
C  0.353582 1.935614 -0.410356
C  0.193525 -0.584401 -0.526413
C  -3.774017 1.227459 2.283709
C  1.021796 -1.004729 -1.565446
C  0.135481 -1.388192 0.608481
C  -3.474622 2.667316 2.678915
C  1.748589 -2.183457 -1.485353
C  0.855708 -2.564924 0.713084
C  2.029861 1.389234 1.379141
C  1.658227 -2.958406 -0.3431
C  1.090503 2.405877 2.923603
H  -2.500773 2.497999 0.109214
H  -3.220937 0.121151 -1.665351
H  -3.068042 1.829637 -2.124253
H  -4.098379 -0.054204 0.579342
H  -4.738573 1.567525 0.386081
H  -0.205138 2.858233 -0.564578
H  1.147873 1.907154 -1.155165
H  -3.003297 0.57123 2.692708
H  -4.714001 0.910192 2.741354
H  -0.487368 -1.085814 1.437292
H  -3.529893 2.78787 3.760865
H  -2.473109 2.972697 2.374335
H  -4.192879 3.361988 2.238176
H  2.376834 -2.48952 -2.309556
H  0.792441 -3.166168 1.608735
H  2.691414 0.796816 0.765578
H  0.878408 2.80835 3.901529
totalener: -1817.01661068 hartree
nucrepener: 2194.52011642 hartree
electener: -4011.53672710 hartree
oneelecener: -6854.28081596 hartree
twoeener: 2842.74408886 hartree
kineticenergy: 1811.91886012 hartree
xcener: -128.816096612611 hartree
chargesum: 0.0000000
charge: -0.054984 -0.064136 -0.348085 -0.339311 0.153813 -0.327116 -0.329107 0.546145 0.077971 0.054854 -0.179601 -0.207315 -0.101304 -0.073326 0.011134 -0.104167 -0.277830 -0.158239 -0.146689 0.028165 0.111037 0.074481 0.081707 0.060188 0.081232 0.066856 0.072969 0.114264 0.138108 0.066163 0.068524 0.139239 0.085341 0.089713 0.076174 0.113913 0.125204 0.145544 0.128470
qa: -0.0550 -0.0641 -0.3481 -0.3393 0.1538 -0.3271 -0.3291 0.5461 0.0780 0.0549 -0.1796 -0.2073 -0.1013 -0.0733 0.0111 -0.1042 -0.2778 -0.1582 -0.1467 0.0282 0.1110 0.0745 0.0817 0.0602 0.0812 0.0669 0.0730 0.1143 0.1381 0.0662 0.0685 0.1392 0.0853 0.0897 0.0762 0.1139 0.1252 0.1455 0.1285
va: 1.2699 1.2411 2.0079 2.0435 3.2602 2.8497 3.0680 3.8695 3.9305 4.0174 3.9791 3.9391 3.5753 3.8632 3.9977 3.8989 3.9327 4.0974 4.0488 4.0907 3.9220 4.0292 0.9907 0.9982 0.9932 1.0224 1.0095 1.0188 1.0206 1.0147 1.0084 1.0187 1.0075 1.0153 1.0024 1.0282 1.0127 0.9980 1.0014
dispcorr: -0.022801974 hartree
energy: -1817.039412657800
dipole: -32.16274 30.97139 -1.19135 22.81382 -22.65533 0.15848 17.68664 -18.23121 -0.54458
magnitude: 1.31947 au
magnitude: 3.35382 debye
