program: Orca
programVersion: 4.2.1
elementType: Cl Cl O O N N N C C C C C C C C C C C C C C C H H H H H H H H H H H H H H H H H
charge: 0
multiplicity: 1
keywords: wb97x-d3
keywords: def2-TZVPP
keywords: def2/J RIJCOSX GRIDX6 NOFINALGRIDX
keywords: grid4 nofinalgrid
keywords: scfconv7
keywords: smallprint printgap noloewdin
keywords: NOSOSCF
formula: C15H17Cl2N3O2
InChI: InChI=1/C15H17Cl2N3O2/c1-2-3-12-7-21-15(22-12,8-20-10-18-9-19-20)13-5-4-11(16)6-14(13)17/h4-6,9-10,12H,2-3,7-8H2,1H3
39 atoms
Cl 0.406606 -1.060947 2.427459
Cl 0.584204 -5.285708 -0.809893
O  -0.550714 1.158898 0.732451
O  0.101739 1.293899 -1.407871
N  1.817845 2.676046 0.34664
N  1.588021 3.328854 1.48929
N  1.823544 4.77849 -0.206257
C  0.414814 0.724802 -0.163607
C  -1.709884 1.533253 0.013097
C  -1.110459 2.018292 -1.304695
C  -2.706306 0.389738 -0.128278
C  1.791381 1.242527 0.281552
C  0.453806 -0.796907 -0.29451
C  -4.063306 0.854468 -0.64383
C  0.450376 -1.653529 0.805275
C  0.52243 -1.380632 -1.556213
C  -5.058978 -0.289744 -0.765457
C  0.487954 -3.032046 0.651976
C  0.564807 -2.752145 -1.733528
C  1.950688 3.557817 -0.657038
C  0.541478 -3.572958 -0.619708
C  1.604066 4.582667 1.11257
H  -2.173837 2.354271 0.566533
H  -1.736892 1.794964 -2.171055
H  -0.907276 3.093512 -1.289986
H  -2.830105 -0.079362 0.851716
H  -2.306443 -0.384318 -0.791482
H  2.544981 0.898085 -0.42834
H  2.049741 0.854729 1.264616
H  -3.952554 1.338257 -1.619382
H  -4.465506 1.61997 0.026743
H  0.533458 -0.74354 -2.42868
H  -6.024956 0.058809 -1.129978
H  -4.700886 -1.053641 -1.456878
H  -5.224297 -0.772655 0.198434
H  0.475047 -3.673228 1.521687
H  0.612427 -3.175239 -2.726836
H  2.142096 3.266588 -1.67784
H  1.456835 5.388721 1.813803
totalener: -1817.01678619 hartree
nucrepener: 2172.32323279 hartree
electener: -3989.34001898 hartree
oneelecener: -6809.78254148 hartree
twoeener: 2820.44252250 hartree
kineticenergy: 1811.92297206 hartree
xcener: -128.816012190463 hartree
chargesum: 0.0000000
charge: -0.046561 -0.065114 -0.326226 -0.384723 0.119490 -0.294669 -0.333242 0.545076 0.225191 -0.032599 -0.213597 -0.129166 -0.150096 -0.092557 0.016136 -0.146862 -0.251733 -0.158171 -0.153204 0.012015 0.109738 0.053774 0.090902 0.088712 0.095559 0.078830 0.074456 0.123741 0.136805 0.053518 0.063267 0.135122 0.087375 0.075221 0.078108 0.112999 0.125192 0.146823 0.130468
qa: -0.0466 -0.0651 -0.3262 -0.3847 0.1195 -0.2947 -0.3332 0.5451 0.2252 -0.0326 -0.2136 -0.1292 -0.1501 -0.0926 0.0161 -0.1469 -0.2517 -0.1582 -0.1532 0.0120 0.1097 0.0538 0.0909 0.0887 0.0956 0.0788 0.0745 0.1237 0.1368 0.0535 0.0633 0.1351 0.0874 0.0752 0.0781 0.1130 0.1252 0.1468 0.1305
va: 1.2758 1.2403 2.0531 1.9801 3.3575 2.8787 3.0513 3.8874 3.8718 3.9836 3.9504 3.8189 3.5721 3.8826 4.0138 3.9441 3.9484 4.0913 4.0487 4.0710 3.9224 4.0486 0.9990 1.0023 0.9952 1.0242 1.0004 1.0055 1.0330 1.0126 1.0101 1.0323 1.0058 1.0042 1.0037 1.0301 1.0134 1.0091 1.0014
dispcorr: -0.022138970 hartree
energy: -1817.038925158195
dipole: -24.53476 23.75429 -0.78047 18.99495 -19.70754 -0.71259 -11.05272 10.13365 -0.91907
magnitude: 1.40058 au
magnitude: 3.55998 debye
