program: Orca
programVersion: 4.2.1
elementType: Cl Cl Cl O O N N N C C C C C C C C C C C C C C C H H H H H H H H H H H H H H H H
charge: 0
multiplicity: 1
keywords: wb97x-d3
keywords: def2-TZVPP
keywords: def2/J RIJCOSX GRIDX6 NOFINALGRIDX
keywords: grid4 nofinalgrid
keywords: scfconv7
keywords: smallprint printgap noloewdin
keywords: NOSOSCF
formula: C15H16Cl3N3O2
InChI: InChI=1/C15H16Cl3N3O2/c1-2-4-20(15(22)21-5-3-19-10-21)6-7-23-14-12(17)8-11(16)9-13(14)18/h3,5,8-10H,2,4,6-7H2,1H3
39 atoms
Cl 2.430824 0.534394 2.009875
Cl 0.176435 -1.188021 -2.53037
Cl 5.525876 -0.958393 -2.11879
O  0.226102 -0.144443 0.213272
O  -4.003882 1.347483 -0.307116
N  -2.582096 -0.2498 0.420863
N  -2.61101 1.917029 1.383028
N  -1.293132 3.270973 2.521185
C  -3.131391 -1.194268 -0.550886
C  -1.712345 -0.822979 1.434566
C  -4.439821 -1.827661 -0.096863
C  -0.364643 -1.252508 0.893585
C  -3.108644 0.981509 0.432636
C  -4.948902 -2.831333 -1.119143
C  1.444541 -0.366266 -0.313377
C  -3.432857 2.811496 2.033745
C  -1.329979 2.256579 1.709544
C  2.598355 -0.08073 0.410354
C  1.592068 -0.848604 -1.610657
C  -2.602647 3.618124 2.739685
C  3.860362 -0.254373 -0.130155
C  2.839807 -1.03383 -2.180674
C  3.96098 -0.735725 -1.424657
H  -3.257008 -0.692203 -1.50952
H  -2.385479 -1.973054 -0.709102
H  -2.189925 -1.714444 1.848728
H  -1.590374 -0.137945 2.268784
H  -5.18999 -1.051538 0.064178
H  -4.290946 -2.327218 0.864145
H  0.257032 -1.575794 1.732982
H  -0.461827 -2.101593 0.212378
H  -5.88228 -3.286286 -0.788132
H  -5.138265 -2.356603 -2.08321
H  -4.230344 -3.636393 -1.281681
H  -4.505843 2.774792 1.959048
H  -0.470388 1.75442 1.300046
H  -2.875934 4.428944 3.39511
H  4.742387 -0.021506 0.449081
H  2.93139 -1.403364 -3.192027
elementType: Cl O N C H
totalener: -2276.65674148 hartree
nucrepener: 2402.39228470 hartree
electener: -4679.04902617 hartree
oneelecener: -7903.17280098 hartree
twoeener: 3224.12377481 hartree
cpcmener: -0.03586112 hartree
kineticenergy: 2270.83813966 hartree
xcener: -149.626354953678 hartree
chargesum: 0.0000000
charge: -0.062898 -0.065286 -0.076011 -0.352598 -0.516114 -0.112281 -0.050361 -0.387359 -0.066506 -0.069053 -0.081298 -0.058607 0.413197 -0.276553 0.299990 -0.126953 0.050181 -0.024621 -0.038892 -0.126032 -0.095199 -0.091772 0.043007 0.100549 0.096528 0.124977 0.128186 0.070572 0.063302 0.133411 0.120266 0.094047 0.084063 0.083582 0.183322 0.153816 0.169165 0.133129 0.133102
qa: -0.0629 -0.0653 -0.0760 -0.3526 -0.5161 -0.1123 -0.0504 -0.3874 -0.0665 -0.0691 -0.0813 -0.0586 0.4132 -0.2766 0.3000 -0.1270 0.0502 -0.0246 -0.0389 -0.1260 -0.0952 -0.0918 0.0430 0.1005 0.0965 0.1250 0.1282 0.0706 0.0633 0.1334 0.1203 0.0940 0.0841 0.0836 0.1833 0.1538 0.1692 0.1331 0.1331
va: 1.2507 1.2489 1.2239 1.9545 1.9876 3.1849 3.2859 3.1054 3.8557 3.8728 3.8697 3.8501 4.2234 3.9440 3.7018 3.9328 4.0041 4.0279 3.9981 4.0377 4.0170 4.0088 3.9027 1.0158 1.0001 1.0075 0.9987 1.0222 1.0138 1.0036 0.9939 1.0027 1.0006 1.0010 0.9973 1.0359 1.0000 1.0132 1.0129
dispcorr: -0.022138843 hartree
energy: -2276.678880319124
dipole: -43.31791 43.60359 0.28568 -10.25414 6.96873 -3.28541 7.90833 -7.55417 0.35416
magnitude: 3.31677 au
magnitude: 8.43055 debye
