program: Orca
programVersion: 4.2.1
elementType: Cl Cl Cl O O N N N C C C C C C C C C C C C C C C H H H H H H H H H H H H H H H H
charge: 0
multiplicity: 1
keywords: wb97x-d3
keywords: def2-TZVPP
keywords: def2/J RIJCOSX GRIDX6 NOFINALGRIDX
keywords: grid4 nofinalgrid
keywords: scfconv7
keywords: smallprint printgap noloewdin
keywords: NOSOSCF
formula: C15H16Cl3N3O2
InChI: InChI=1/C15H16Cl3N3O2/c1-2-4-20(15(22)21-5-3-19-10-21)6-7-23-14-12(17)8-11(16)9-13(14)18/h3,5,8-10H,2,4,6-7H2,1H3
39 atoms
Cl 0.431272 -2.106184 -1.547481
Cl 2.339058 1.862232 1.503212
Cl 5.700636 -1.084772 -1.472471
O  0.27341 0.132784 0.333136
O  -3.887013 -0.103697 -1.115853
N  -2.490662 -0.548836 0.597445
N  -2.982994 1.683261 -0.059284
N  -2.167583 3.730773 -0.030449
C  -2.72568 -1.982836 0.418281
C  -1.653807 -0.158562 1.717761
C  -4.080659 -2.463982 0.925909
C  -0.190737 -0.502184 1.523486
C  -3.13554 0.274835 -0.240698
C  -4.35647 -2.145954 2.387247
C  1.526973 -0.168327 -0.050679
C  -4.05923 2.538964 -0.140218
C  -1.865581 2.467635 -0.012731
C  1.768226 -1.198885 -0.954863
C  2.618568 0.565415 0.405095
C  -3.534204 3.789505 -0.099976
C  3.044558 -1.49016 -1.404547
C  3.907318 0.296678 -0.022312
C  4.101652 -0.736172 -0.924005
H  -2.612489 -2.239959 -0.634278
H  -1.933635 -2.50968 0.949468
H  -1.985935 -0.685372 2.614235
H  -1.774471 0.899917 1.934846
H  -4.102291 -3.546443 0.777956
H  -4.876887 -2.056601 0.302053
H  0.364482 -0.152579 2.398496
H  -0.044775 -1.583601 1.453731
H  -4.400645 -1.071292 2.572508
H  -5.318423 -2.558571 2.693631
H  -3.596914 -2.570754 3.046698
H  -5.075096 2.186857 -0.195183
H  -0.869243 2.060074 0.010337
H  -4.065859 4.727854 -0.116588
H  3.206681 -2.28966 -2.113873
H  4.739162 0.883215 0.341417
elementType: Cl O N C H
totalener: -2276.66578083 hartree
nucrepener: 2417.91383574 hartree
electener: -4694.57961657 hartree
oneelecener: -7934.26192021 hartree
twoeener: 3239.68230364 hartree
cpcmener: -0.02969339 hartree
kineticenergy: 2270.84101409 hartree
xcener: -149.625952099511 hartree
chargesum: 0.0000000
charge: -0.061882 -0.060198 -0.073641 -0.346601 -0.476355 -0.100249 -0.054819 -0.380949 -0.076034 -0.099330 -0.100096 -0.043108 0.386044 -0.290690 0.292210 -0.125184 0.037418 -0.043586 -0.032076 -0.123117 -0.081942 -0.086432 0.036284 0.095029 0.109377 0.132060 0.130061 0.076980 0.075613 0.125884 0.116867 0.080494 0.100221 0.086313 0.180289 0.166140 0.165552 0.131736 0.131718
qa: -0.0619 -0.0602 -0.0736 -0.3466 -0.4764 -0.1002 -0.0548 -0.3809 -0.0760 -0.0993 -0.1001 -0.0431 0.3860 -0.2907 0.2922 -0.1252 0.0374 -0.0436 -0.0321 -0.1231 -0.0819 -0.0864 0.0363 0.0950 0.1094 0.1321 0.1301 0.0770 0.0756 0.1259 0.1169 0.0805 0.1002 0.0863 0.1803 0.1661 0.1656 0.1317 0.1317
va: 1.2551 1.2536 1.2266 1.9524 2.0354 3.1221 3.2772 3.1130 3.8745 3.8775 3.8642 3.8472 4.2535 3.9338 3.6950 3.9292 4.0036 4.0122 4.0246 4.0346 3.9940 4.0087 3.9136 1.0168 0.9955 1.0021 0.9994 1.0115 1.0216 1.0069 0.9965 0.9989 1.0068 0.9971 0.9977 1.0272 1.0010 1.0135 1.0136
dispcorr: -0.022888445 hartree
energy: -2276.688669277622
dipole: -41.78731 42.46512 0.67781 -8.04452 5.75591 -2.28860 17.09008 -14.90720 2.18288
magnitude: 3.23452 au
magnitude: 8.22150 debye
