program: Orca
programVersion: 4.2.1
elementType: Cl Cl Cl O O N N N C C C C C C C C C C C C C C C H H H H H H H H H H H H H H H H
charge: 0
multiplicity: 1
keywords: wb97x-d3
keywords: def2-TZVPP
keywords: def2/J RIJCOSX GRIDX6 NOFINALGRIDX
keywords: grid4 nofinalgrid
keywords: scfconv7
keywords: smallprint printgap noloewdin
keywords: NOSOSCF
formula: C15H16Cl3N3O2
InChI: InChI=1/C15H16Cl3N3O2/c1-2-4-20(15(22)21-5-3-19-10-21)6-7-23-14-12(17)8-11(16)9-13(14)18/h3,5,8-10H,2,4,6-7H2,1H3
39 atoms
Cl 2.109693 -2.561276 -1.759956
Cl 0.873036 1.383279 1.655763
Cl 6.009717 0.342146 0.514218
O  0.323707 -0.806288 -0.239226
O  -3.030797 -0.767354 -1.90451
N  -2.401384 -0.572181 0.278869
N  -3.186667 1.274492 -0.92735
N  -4.253116 3.114257 -1.508037
C  -2.770951 -0.030008 1.579424
C  -1.735452 -1.857887 0.277596
C  -3.986563 -0.714492 2.199295
C  -0.273583 -1.733242 0.657584
C  -2.875884 -0.107852 -0.908799
C  -5.255665 -0.564812 1.373979
C  1.62911 -0.561518 -0.040559
C  -2.43018 2.327604 -0.460609
C  -4.260352 1.819956 -1.569252
C  2.606684 -1.30012 -0.704509
C  2.054288 0.452837 0.813504
C  -3.110299 3.444195 -0.831598
C  3.955137 -1.028706 -0.547108
C  3.3957 0.74508 0.99063
C  4.335667 -0.006532 0.306012
H  -1.911319 -0.118196 2.247354
H  -2.971147 1.03546 1.495393
H  -1.822041 -2.301531 -0.711805
H  -2.2182 -2.547569 0.976077
H  -4.135132 -0.272022 3.187808
H  -3.780797 -1.773437 2.378088
H  -0.152965 -1.392167 1.691689
H  0.201654 -2.716965 0.577825
H  -6.110181 -0.996532 1.894288
H  -5.484664 0.484707 1.181827
H  -5.180051 -1.072254 0.411769
H  -1.483945 2.182573 0.03213
H  -5.011185 1.207359 -2.043065
H  -2.833327 4.471885 -0.659134
H  4.693895 -1.609772 -1.079801
H  3.699033 1.542887 1.652882
totalener: -2276.63820869 hartree
nucrepener: 2409.61930610 hartree
electener: -4686.25751479 hartree
oneelecener: -7917.66798499 hartree
twoeener: 3231.41047020 hartree
kineticenergy: 2270.87994428 hartree
xcener: -149.628320168337 hartree
chargesum: -0.0000000
charge: -0.041562 -0.069117 -0.056741 -0.307180 -0.354449 -0.110826 -0.011264 -0.299452 -0.101765 -0.077860 -0.109095 -0.056789 0.277406 -0.263422 0.255076 -0.168503 0.048874 -0.038983 0.016557 -0.083618 -0.098721 -0.115554 0.043323 0.085709 0.120555 0.119999 0.095933 0.071699 0.059602 0.098517 0.115499 0.097739 0.090281 0.083630 0.164033 0.144170 0.129836 0.121605 0.124858
qa: -0.0416 -0.0691 -0.0567 -0.3072 -0.3544 -0.1108 -0.0113 -0.2995 -0.1018 -0.0779 -0.1091 -0.0568 0.2774 -0.2634 0.2551 -0.1685 0.0489 -0.0390 0.0166 -0.0836 -0.0987 -0.1156 0.0433 0.0857 0.1206 0.1200 0.0959 0.0717 0.0596 0.0985 0.1155 0.0977 0.0903 0.0836 0.1640 0.1442 0.1298 0.1216 0.1249
va: 1.2737 1.2443 1.2445 2.0181 2.1468 3.0310 3.2159 3.1341 3.8908 3.8924 3.8939 3.8778 4.3046 3.9351 3.7951 3.8922 4.0383 4.0119 3.9540 4.0805 4.0145 4.0321 3.9579 1.0103 0.9960 1.0398 1.0032 1.0133 1.0067 0.9926 1.0068 1.0087 1.0030 1.0068 1.0199 1.0074 1.0097 1.0192 1.0157
dispcorr: -0.023131119 hartree
energy: -2276.661339806153
dipole: -44.47613 45.33137 0.85524 -2.67347 1.53893 -1.13454 11.79101 -9.76592 2.02509
magnitude: 2.47379 au
magnitude: 6.28787 debye
