program: Orca
programVersion: 4.2.1
elementType: Cl Cl Cl O O N N N C C C C C C C C C C C C C C C H H H H H H H H H H H H H H H H
charge: 0
multiplicity: 1
keywords: wb97x-d3
keywords: def2-TZVPP
keywords: def2/J RIJCOSX GRIDX6 NOFINALGRIDX
keywords: grid4 nofinalgrid
keywords: scfconv7
keywords: smallprint printgap noloewdin
keywords: NOSOSCF
formula: C15H16Cl3N3O2
InChI: InChI=1/C15H16Cl3N3O2/c1-2-4-20(15(22)21-5-3-19-10-21)6-7-23-14-12(17)8-11(16)9-13(14)18/h3,5,8-10H,2,4,6-7H2,1H3
39 atoms
Cl 1.639799 2.035551 -1.084315
Cl 0.84933 -3.007859 0.56064
Cl 5.832153 -1.218612 -0.286617
O  0.061013 -0.258673 -0.199239
O  -4.559654 0.661179 1.002606
N  -2.840474 -0.070686 -0.278249
N  -2.95773 2.170072 0.460572
N  -2.966217 4.370122 0.632115
C  -3.344482 -1.436899 -0.166838
C  -1.968925 0.213744 -1.401638
C  -2.921572 -2.120063 1.126056
C  -0.660229 -0.55068 -1.390458
C  -3.524063 0.872907 0.422093
C  -3.331401 -3.584795 1.145767
C  1.384671 -0.500297 -0.246991
C  -1.643008 2.555853 0.624932
C  -3.704626 3.315521 0.49624
C  2.273476 0.503211 -0.628156
C  1.915718 -1.739624 0.100571
C  -1.680245 3.909813 0.723301
C  3.642233 0.298529 -0.63963
C  3.281129 -1.970984 0.096419
C  4.132253 -0.944692 -0.276436
H  -4.432481 -1.442705 -0.261225
H  -2.957989 -1.999849 -1.019145
H  -1.764396 1.279865 -1.460376
H  -2.479981 -0.054544 -2.334793
H  -3.371931 -1.598998 1.972302
H  -1.839996 -2.029635 1.241349
H  -0.826511 -1.630151 -1.462052
H  -0.090251 -0.247368 -2.275057
H  -2.8643 -4.143174 0.332025
H  -3.036147 -4.061564 2.079694
H  -4.411826 -3.700634 1.047916
H  -0.834557 1.850783 0.689651
H  -4.779105 3.295975 0.406272
H  -0.848776 4.580715 0.868896
H  4.311338 1.095136 -0.930902
H  3.670453 -2.938902 0.376952
totalener: -2276.63955748 hartree
nucrepener: 2414.88221860 hartree
electener: -4691.52177608 hartree
oneelecener: -7927.94501962 hartree
twoeener: 3236.42324354 hartree
kineticenergy: 2270.87072328 hartree
xcener: -149.626157214516 hartree
chargesum: -0.0000000
charge: -0.045522 -0.055747 -0.054063 -0.333222 -0.375859 -0.127927 -0.058942 -0.301231 -0.083922 -0.146029 -0.100726 -0.054701 0.343720 -0.259008 0.264405 -0.171016 0.060072 -0.017277 -0.004645 -0.077536 -0.108507 -0.108118 0.045739 0.112971 0.081289 0.126108 0.117717 0.092355 0.061022 0.108832 0.130436 0.069584 0.090932 0.085100 0.174493 0.142552 0.128654 0.124370 0.123648
qa: -0.0455 -0.0557 -0.0541 -0.3332 -0.3759 -0.1279 -0.0589 -0.3012 -0.0839 -0.1460 -0.1007 -0.0547 0.3437 -0.2590 0.2644 -0.1710 0.0601 -0.0173 -0.0046 -0.0775 -0.1085 -0.1081 0.0457 0.1130 0.0813 0.1261 0.1177 0.0924 0.0610 0.1088 0.1304 0.0696 0.0909 0.0851 0.1745 0.1426 0.1287 0.1244 0.1236
va: 1.2754 1.2598 1.2472 1.9650 2.1279 3.0595 3.2809 3.1432 3.8494 3.9405 3.8347 3.8151 4.2764 3.9392 3.7187 3.8830 4.0405 4.0319 3.9787 4.0686 4.0184 4.0253 3.9524 1.0203 1.0048 1.0040 1.0014 1.0211 1.0312 1.0047 0.9963 1.0031 1.0056 1.0033 1.0215 1.0099 1.0123 1.0166 1.0164
dispcorr: -0.023060238 hartree
energy: -2276.662617713231
dipole: -36.18813 37.41990 1.23177 -7.84312 6.11953 -1.72359 0.57798 -1.91310 -1.33512
magnitude: 2.50411 au
magnitude: 6.36494 debye
