program: Orca
programVersion: 4.2.1
elementType: Cl Cl Cl O O N N N C C C C C C C C C C C C C C C H H H H H H H H H H H H H H H H
charge: 0
multiplicity: 1
keywords: wb97x-d3
keywords: def2-TZVPP
keywords: def2/J RIJCOSX GRIDX6 NOFINALGRIDX
keywords: grid4 nofinalgrid
keywords: scfconv7
keywords: smallprint printgap noloewdin
keywords: NOSOSCF
formula: C15H16Cl3N3O2
InChI: InChI=1/C15H16Cl3N3O2/c1-2-4-20(15(22)21-5-3-19-10-21)6-7-23-14-12(17)8-11(16)9-13(14)18/h3,5,8-10H,2,4,6-7H2,1H3
39 atoms
Cl 0.318214 -0.979612 -2.274281
Cl 2.747572 -0.427871 2.469116
Cl 5.67769 -1.022838 -1.98774
O  0.463986 -0.649577 0.637419
O  -4.696049 0.400468 -0.14219
N  -2.527799 0.115212 0.47511
N  -3.475847 2.264674 0.290382
N  -2.716214 4.313868 -0.024048
C  -2.645666 -1.323725 0.241115
C  -1.475901 0.552337 1.378005
C  -3.320577 -2.087196 1.374331
C  -0.089249 0.657253 0.772778
C  -3.631885 0.855679 0.191959
C  -3.385961 -3.576114 1.065497
C  1.663727 -0.708292 0.031105
C  -4.468596 3.120765 0.707378
C  -2.45114 3.053667 -0.156311
C  1.763318 -0.87623 -1.347867
C  2.845032 -0.628136 0.76439
C  -3.969102 4.370508 0.523443
C  2.990569 -0.979506 -1.980327
C  4.084997 -0.727449 0.156702
C  4.142464 -0.898865 -1.216161
H  -3.201188 -1.473113 -0.68427
H  -1.644167 -1.714658 0.07099
H  -1.426597 -0.133287 2.229573
H  -1.732182 1.52376 1.796189
H  -4.326594 -1.695661 1.530975
H  -2.771432 -1.936592 2.308242
H  -0.121167 1.154763 -0.20076
H  0.538759 1.2584 1.438696
H  -3.965566 -3.767297 0.161386
H  -2.390685 -3.997455 0.915546
H  -3.856996 -4.127437 1.878401
H  -5.408882 2.762421 1.087312
H  -1.561593 2.644775 -0.607941
H  -4.443197 5.311075 0.75255
H  3.043628 -1.116587 -3.050552
H  4.988233 -0.667868 0.746303
totalener: -2276.63997400 hartree
nucrepener: 2363.02643631 hartree
electener: -4639.66641031 hartree
oneelecener: -7824.24567603 hartree
twoeener: 3184.57926572 hartree
kineticenergy: 2270.86970946 hartree
xcener: -149.624131418021 hartree
chargesum: 0.0000000
charge: -0.047532 -0.049703 -0.055218 -0.327763 -0.372903 -0.151601 -0.061989 -0.297049 -0.068091 -0.134707 -0.089236 -0.027979 0.357405 -0.262938 0.257700 -0.104742 0.001550 -0.007680 -0.027771 -0.083736 -0.111184 -0.100505 0.042871 0.101856 0.089410 0.119991 0.130608 0.081657 0.052232 0.100736 0.109709 0.083740 0.076931 0.087127 0.158384 0.152362 0.132162 0.123784 0.122111
qa: -0.0475 -0.0497 -0.0552 -0.3278 -0.3729 -0.1516 -0.0620 -0.2970 -0.0681 -0.1347 -0.0892 -0.0280 0.3574 -0.2629 0.2577 -0.1047 0.0016 -0.0077 -0.0278 -0.0837 -0.1112 -0.1005 0.0429 0.1019 0.0894 0.1200 0.1306 0.0817 0.0522 0.1007 0.1097 0.0837 0.0769 0.0871 0.1584 0.1524 0.1322 0.1238 0.1221
va: 1.2665 1.2650 1.2461 2.0035 2.1316 3.1101 3.2816 3.1348 3.8597 3.9276 3.8634 3.8425 4.2509 3.9569 3.7699 3.9246 4.0537 4.0105 4.0023 4.0374 4.0211 4.0224 3.9520 1.0143 1.0278 1.0147 0.9989 1.0214 1.0132 1.0047 1.0066 1.0028 1.0018 1.0052 1.0078 1.0023 1.0078 1.0166 1.0179
dispcorr: -0.021308469 hartree
energy: -2276.661282465084
dipole: -38.26516 39.13597 0.87081 -2.52264 1.71315 -0.80949 12.28685 -11.59598 0.69087
magnitude: 1.37510 au
magnitude: 3.49521 debye
