program: Orca
programVersion: 4.2.1
elementType: Cl Cl Cl O O N N N C C C C C C C C C C C C C C C H H H H H H H H H H H H H H H H
charge: 0
multiplicity: 1
keywords: wb97x-d3
keywords: def2-TZVPP
keywords: def2/J RIJCOSX GRIDX6 NOFINALGRIDX
keywords: grid4 nofinalgrid
keywords: scfconv7
keywords: smallprint printgap noloewdin
keywords: NOSOSCF
formula: C15H16Cl3N3O2
InChI: InChI=1/C15H16Cl3N3O2/c1-2-4-20(15(22)21-5-3-19-10-21)6-7-23-14-12(17)8-11(16)9-13(14)18/h3,5,8-10H,2,4,6-7H2,1H3
39 atoms
Cl 2.436503 -3.343881 0.794675
Cl 0.492231 1.569163 -0.124489
Cl 5.761196 0.652431 -0.541432
O  0.357533 -1.280562 0.589131
O  -2.368906 -0.125502 -2.135141
N  -2.441311 -0.475305 0.096988
N  -3.141415 1.579651 -0.864303
N  -3.376507 3.708682 -1.40414
C  -2.423386 0.040113 1.463845
C  -1.863706 -1.793429 -0.131226
C  -3.609248 -0.366938 2.334647
C  -0.398662 -1.778479 -0.518616
C  -2.631868 0.264855 -1.021841
C  -3.728524 -1.852927 2.643304
C  1.595065 -0.844497 0.302889
C  -4.161913 2.07695 -0.081404
C  -2.726482 2.617252 -1.654089
C  2.69401 -1.697972 0.36654
C  1.826374 0.485242 -0.043571
C  -4.283596 3.382849 -0.434799
C  3.979646 -1.250219 0.115134
C  3.101426 0.958941 -0.302181
C  4.167792 0.079481 -0.222384
H  -1.500307 -0.301424 1.933032
H  -2.350747 1.125712 1.433312
H  -2.416145 -2.30679 -0.918871
H  -1.988339 -2.380735 0.776544
H  -4.545108 -0.025078 1.888229
H  -3.506715 0.183982 3.273435
H  -0.083366 -2.800502 -0.753288
H  -0.236935 -1.161968 -1.404146
H  -4.514817 -2.027961 3.377258
H  -3.984684 -2.436821 1.759322
H  -2.80153 -2.253049 3.058429
H  -4.724542 1.4717 0.60449
H  -1.936821 2.496581 -2.37837
H  -4.984003 4.105613 -0.047857
H  4.816652 -1.930411 0.177112
H  3.256009 1.99562 -0.564013
totalener: -2276.63914759 hartree
nucrepener: 2430.11572624 hartree
electener: -4706.75487383 hartree
oneelecener: -7958.80641593 hartree
twoeener: 3252.05154209 hartree
kineticenergy: 2270.87328021 hartree
xcener: -149.629591206971 hartree
chargesum: -0.0000000
charge: -0.052948 -0.053179 -0.057820 -0.336948 -0.389328 -0.125411 -0.037600 -0.300143 -0.141633 -0.068825 -0.095410 -0.061696 0.312246 -0.270608 0.229756 -0.167831 0.054420 -0.013055 0.023791 -0.078616 -0.104450 -0.110630 0.045117 0.123762 0.124302 0.114152 0.113142 0.057077 0.073890 0.104927 0.131205 0.097953 0.078383 0.086767 0.169727 0.149020 0.130852 0.120201 0.125441
qa: -0.0529 -0.0532 -0.0578 -0.3369 -0.3893 -0.1254 -0.0376 -0.3001 -0.1416 -0.0688 -0.0954 -0.0617 0.3122 -0.2706 0.2298 -0.1678 0.0544 -0.0131 0.0238 -0.0786 -0.1044 -0.1106 0.0451 0.1238 0.1243 0.1142 0.1131 0.0571 0.0739 0.1049 0.1312 0.0980 0.0784 0.0868 0.1697 0.1490 0.1309 0.1202 0.1254
va: 1.2623 1.2710 1.2436 1.9906 2.1062 3.0649 3.2438 3.1466 3.8647 3.9109 3.8732 3.8598 4.2764 3.9386 3.8233 3.9035 4.0307 3.9791 3.9810 4.0772 4.0241 4.0272 3.9539 1.0169 0.9962 1.0114 1.0029 1.0178 1.0110 1.0116 1.0021 1.0089 0.9991 1.0008 0.9980 1.0121 1.0093 1.0190 1.0168
dispcorr: -0.023315786 hartree
energy: -2276.662463377706
dipole: -41.79472 41.82084 0.02612 -4.42627 3.09910 -1.32717 11.38206 -9.98524 1.39682
magnitude: 1.92696 au
magnitude: 4.89795 debye
