program: Orca
programVersion: 4.2.1
elementType: Cl Cl Cl O O N N N C C C C C C C C C C C C C C C H H H H H H H H H H H H H H H H
charge: 0
multiplicity: 1
keywords: wb97x-d3
keywords: def2-TZVPP
keywords: def2/J RIJCOSX GRIDX6 NOFINALGRIDX
keywords: grid4 nofinalgrid
keywords: scfconv7
keywords: smallprint printgap noloewdin
keywords: NOSOSCF
formula: C15H16Cl3N3O2
InChI: InChI=1/C15H16Cl3N3O2/c1-2-4-20(15(22)21-5-3-19-10-21)6-7-23-14-12(17)8-11(16)9-13(14)18/h3,5,8-10H,2,4,6-7H2,1H3
39 atoms
Cl 0.522635 1.54472 -0.003996
Cl 1.88493 -3.360661 -1.694405
Cl 5.573283 0.532411 -1.497649
O  0.067774 -1.276952 -0.703202
O  -1.460942 -0.151958 2.81455
N  -2.339772 -0.438313 0.753433
N  -2.544696 1.621315 1.924779
N  -2.452067 3.737375 2.554614
C  -2.812496 0.09737 -0.52029
C  -1.767436 -1.778436 0.742687
C  -4.257084 -0.244982 -0.875861
C  -0.260967 -1.814681 0.57987
C  -2.083768 0.280601 1.872979
C  -4.565221 -1.725183 -1.050772
C  1.338118 -0.869977 -0.860627
C  -3.73567 2.202286 1.542577
C  -1.824933 2.60499 2.548358
C  1.712256 0.442838 -0.580377
C  2.320564 -1.736648 -1.333823
C  -3.649658 3.497906 1.940513
C  3.009084 0.887175 -0.77461
C  3.624007 -1.31773 -1.539033
C  3.955193 -0.004595 -1.250649
H  -2.682875 1.178239 -0.524912
H  -2.150488 -0.278151 -1.3012
H  -2.227845 -2.33636 -0.070385
H  -2.020881 -2.298324 1.667146
H  -4.48078 0.279714 -1.808544
H  -4.940605 0.166474 -0.130608
H  0.230724 -1.249691 1.373197
H  0.07606 -2.854494 0.645305
H  -5.586405 -1.861503 -1.405791
H  -3.902872 -2.193905 -1.780843
H  -4.479099 -2.273079 -0.112403
H  -4.534796 1.656749 1.077506
H  -0.847324 2.415276 2.961465
H  -4.392515 4.271037 1.826448
H  3.273868 1.911075 -0.553997
H  4.366733 -2.007707 -1.912368
totalener: -2276.63911630 hartree
nucrepener: 2434.39996805 hartree
electener: -4711.03908436 hartree
oneelecener: -7967.39742588 hartree
twoeener: 3256.35834153 hartree
kineticenergy: 2270.87646247 hartree
xcener: -149.631004856491 hartree
chargesum: -0.0000000
charge: -0.051755 -0.052976 -0.057750 -0.337651 -0.390824 -0.123590 -0.036977 -0.299241 -0.141102 -0.067642 -0.093808 -0.062772 0.310141 -0.271015 0.226955 -0.169264 0.051071 0.023157 -0.014787 -0.077892 -0.107490 -0.099815 0.041908 0.122265 0.123027 0.113036 0.114031 0.073048 0.057089 0.132225 0.105142 0.097302 0.086522 0.080486 0.170377 0.151829 0.130911 0.125728 0.120101
qa: -0.0518 -0.0530 -0.0578 -0.3377 -0.3908 -0.1236 -0.0370 -0.2992 -0.1411 -0.0676 -0.0938 -0.0628 0.3101 -0.2710 0.2270 -0.1693 0.0511 0.0232 -0.0148 -0.0779 -0.1075 -0.0998 0.0419 0.1223 0.1230 0.1130 0.1140 0.0730 0.0571 0.1322 0.1051 0.0973 0.0865 0.0805 0.1704 0.1518 0.1309 0.1257 0.1201
va: 1.2728 1.2623 1.2436 1.9926 2.1035 3.0611 3.2431 3.1479 3.8664 3.9127 3.8730 3.8595 4.2772 3.9393 3.8285 3.9017 4.0299 3.9808 3.9808 4.0766 4.0234 4.0223 3.9559 0.9975 1.0166 1.0012 1.0113 1.0116 1.0171 1.0021 1.0112 1.0093 1.0001 0.9994 0.9978 1.0116 1.0093 1.0168 1.0190
dispcorr: -0.023377232 hartree
energy: -2276.662493535417
dipole: -43.39797 42.84640 -0.55158 -3.44530 2.14957 -1.29573 4.33184 -5.66833 -1.33648
magnitude: 1.94148 au
magnitude: 4.93484 debye
