program: Orca
programVersion: 4.2.1
elementType: Cl Cl Cl O O N N N C C C C C C C C C C C C C C C H H H H H H H H H H H H H H H H
charge: 0
multiplicity: 1
keywords: wb97x-d3
keywords: def2-TZVPP
keywords: def2/J RIJCOSX GRIDX6 NOFINALGRIDX
keywords: grid4 nofinalgrid
keywords: scfconv7
keywords: smallprint printgap noloewdin
keywords: NOSOSCF
formula: C15H16Cl3N3O2
InChI: InChI=1/C15H16Cl3N3O2/c1-2-4-20(15(22)21-5-3-19-10-21)6-7-23-14-12(17)8-11(16)9-13(14)18/h3,5,8-10H,2,4,6-7H2,1H3
39 atoms
Cl 1.27257 1.667073 -2.098281
Cl 1.06801 -2.322421 1.46341
Cl 5.817241 -0.61234 -0.366245
O  -0.015284 -0.231855 -0.298803
O  -2.368615 0.040258 2.316333
N  -2.737122 -0.680893 0.189091
N  -2.359854 1.588934 0.652582
N  -1.587596 3.647543 0.50481
C  -3.030227 -2.022488 0.689937
C  -2.183731 -0.589562 -1.150557
C  -4.44916 -2.153088 1.227697
C  -0.737432 -1.041244 -1.21654
C  -2.468038 0.261545 1.138357
C  -5.513145 -1.85888 0.181131
C  1.324143 -0.34463 -0.330834
C  -3.166154 2.244556 -0.251417
C  -1.436601 2.49561 1.079946
C  2.085625 0.500884 -1.133851
C  1.991222 -1.280115 0.45445
C  -2.669342 3.508316 -0.319392
C  3.468176 0.432468 -1.149954
C  3.373172 -1.369535 0.455769
C  4.097106 -0.510998 -0.354596
H  -2.904271 -2.712432 -0.147216
H  -2.303316 -2.312642 1.450987
H  -2.250342 0.42889 -1.526791
H  -2.782594 -1.209243 -1.820163
H  -4.575447 -1.501075 2.093212
H  -4.567097 -3.173951 1.600045
H  -0.632967 -2.099237 -0.952935
H  -0.364063 -0.907536 -2.237494
H  -5.430782 -2.533644 -0.67348
H  -6.514726 -1.976594 0.593662
H  -5.434226 -0.83754 -0.192954
H  -4.020262 1.777155 -0.710848
H  -0.67624 2.234202 1.798483
H  -3.039561 4.330812 -0.910401
H  4.041094 1.103051 -1.77376
H  3.872524 -2.098214 1.077641
totalener: -2276.63798280 hartree
nucrepener: 2458.00022179 hartree
electener: -4734.63820459 hartree
oneelecener: -8014.93826289 hartree
twoeener: 3280.30005829 hartree
kineticenergy: 2270.88370122 hartree
xcener: -149.626231489194 hartree
chargesum: 0.0000000
charge: -0.039149 -0.048968 -0.058719 -0.305896 -0.349905 -0.142372 -0.001989 -0.296543 -0.098450 -0.083412 -0.091438 -0.067021 0.293393 -0.261297 0.283947 -0.166664 0.056274 -0.056457 -0.048054 -0.090247 -0.086180 -0.089004 0.035893 0.088521 0.108963 0.118522 0.096491 0.085623 0.069131 0.105790 0.121569 0.071229 0.095821 0.075321 0.163858 0.138431 0.129082 0.121822 0.122081
qa: -0.0391 -0.0490 -0.0587 -0.3059 -0.3499 -0.1424 -0.0020 -0.2965 -0.0984 -0.0834 -0.0914 -0.0670 0.2934 -0.2613 0.2839 -0.1667 0.0563 -0.0565 -0.0481 -0.0902 -0.0862 -0.0890 0.0359 0.0885 0.1090 0.1185 0.0965 0.0856 0.0691 0.1058 0.1216 0.0712 0.0958 0.0753 0.1639 0.1384 0.1291 0.1218 0.1221
va: 1.2778 1.2672 1.2422 1.9817 2.1547 3.0094 3.2379 3.1253 3.9110 3.9275 3.8589 3.8788 4.3416 3.9230 3.6644 3.9001 4.0538 4.0641 4.0368 4.0788 3.9946 3.9971 3.9470 0.9953 1.0215 1.0113 1.0027 1.0181 1.0133 0.9995 1.0025 1.0030 1.0089 1.0081 0.9942 1.0091 1.0093 1.0180 1.0179
dispcorr: -0.023733832 hartree
energy: -2276.661716635883
dipole: -46.50556 46.07555 -0.43001 -8.57015 6.80632 -1.76383 -0.95710 -0.54912 -1.50621
magnitude: 2.35895 au
magnitude: 5.99599 debye
