program: Orca
programVersion: 4.2.1
elementType: Cl Cl Cl O O N N N C C C C C C C C C C C C C C C H H H H H H H H H H H H H H H H
charge: 0
multiplicity: 1
keywords: wb97x-d3
keywords: def2-TZVPP
keywords: def2/J RIJCOSX GRIDX6 NOFINALGRIDX
keywords: grid4 nofinalgrid
keywords: scfconv7
keywords: smallprint printgap noloewdin
keywords: NOSOSCF
formula: C15H16Cl3N3O2
InChI: InChI=1/C15H16Cl3N3O2/c1-2-4-20(15(22)21-5-3-19-10-21)6-7-23-14-12(17)8-11(16)9-13(14)18/h3,5,8-10H,2,4,6-7H2,1H3
39 atoms
Cl 1.653936 -3.596454 0.223047
Cl 1.269305 1.669408 -0.699798
Cl 5.844757 -0.910052 -1.787388
O  0.319943 -1.00239 0.131289
O  -1.803782 1.53588 2.56236
N  -2.311112 -0.190313 1.182664
N  -3.621514 1.762072 1.222722
N  -5.682828 2.301539 0.650286
C  -2.806124 -0.631069 -0.125408
C  -1.326148 -1.018157 1.860522
C  -2.484051 0.285871 -1.298698
C  0.117913 -0.724492 1.517038
C  -2.503715 1.041959 1.711302
C  -2.927533 -0.347957 -2.609364
C  1.596745 -0.964803 -0.285952
C  -3.634321 3.125942 1.040558
C  -4.896455 1.328656 0.983662
C  2.365491 -2.126417 -0.315967
C  2.190011 0.217294 -0.722567
C  -4.904799 3.427887 0.668495
C  3.669624 -2.1259 -0.779968
C  3.493285 0.246103 -1.189644
C  4.221913 -0.931045 -1.209928
H  -2.338103 -1.596868 -0.311603
H  -3.879572 -0.828456 -0.091631
H  -1.54957 -2.061642 1.633414
H  -1.438273 -0.897958 2.93852
H  -1.411144 0.477693 -1.317612
H  -2.978529 1.251513 -1.185216
H  0.365334 0.314944 1.74128
H  0.757695 -1.36968 2.129207
H  -2.706544 0.305972 -3.451841
H  -2.419845 -1.296943 -2.789065
H  -4.002045 -0.537995 -2.618865
H  -2.755099 3.728424 1.18498
H  -5.194546 0.300507 1.112185
H  -5.308221 4.395063 0.416152
H  4.243212 -3.041127 -0.799389
H  3.930735 1.174159 -1.528023
totalener: -2276.64016905 hartree
nucrepener: 2396.97742422 hartree
electener: -4673.61759327 hartree
oneelecener: -7892.52224070 hartree
twoeener: 3218.90464744 hartree
kineticenergy: 2270.87590964 hartree
xcener: -149.626870834609 hartree
chargesum: 0.0000000
charge: -0.052468 -0.051213 -0.057977 -0.326801 -0.384079 -0.144961 -0.055420 -0.291736 -0.130977 -0.071165 -0.070000 -0.055745 0.361997 -0.271815 0.264192 -0.118715 0.019606 -0.046712 0.001886 -0.073381 -0.098622 -0.110306 0.044525 0.096773 0.107403 0.099982 0.102525 0.065884 0.082589 0.131428 0.109537 0.091340 0.079334 0.083295 0.151851 0.141682 0.130649 0.121306 0.124307
qa: -0.0525 -0.0512 -0.0580 -0.3268 -0.3841 -0.1450 -0.0554 -0.2917 -0.1310 -0.0712 -0.0700 -0.0557 0.3620 -0.2718 0.2642 -0.1187 0.0196 -0.0467 0.0019 -0.0734 -0.0986 -0.1103 0.0445 0.0968 0.1074 0.1000 0.1025 0.0659 0.0826 0.1314 0.1095 0.0913 0.0793 0.0833 0.1519 0.1417 0.1306 0.1213 0.1243
va: 1.2643 1.2587 1.2434 1.9857 2.1223 3.1080 3.2705 3.1318 3.8992 3.9486 3.8183 3.8079 4.2432 3.9664 3.7557 3.9227 4.0589 4.0153 4.0032 4.0244 4.0140 4.0278 3.9483 1.0115 0.9923 1.0075 1.0165 1.0368 1.0146 1.0112 1.0025 1.0054 1.0022 1.0026 1.0121 1.0005 1.0075 1.0186 1.0163
dispcorr: -0.022729831 hartree
energy: -2276.662898878469
dipole: -36.99143 37.95802 0.96659 4.94982 -6.01189 -1.06206 0.52754 -0.87374 -0.34619
magnitude: 1.47720 au
magnitude: 3.75475 debye
