program: Orca
programVersion: 4.2.1
elementType: Cl Cl Cl O O N N N C C C C C C C C C C C C C C C H H H H H H H H H H H H H H H H
charge: 0
multiplicity: 1
keywords: wb97x-d3
keywords: def2-TZVPP
keywords: def2/J RIJCOSX GRIDX6 NOFINALGRIDX
keywords: grid4 nofinalgrid
keywords: scfconv7
keywords: smallprint printgap noloewdin
keywords: NOSOSCF
formula: C15H16Cl3N3O2
InChI: InChI=1/C15H16Cl3N3O2/c1-2-4-20(15(22)21-5-3-19-10-21)6-7-23-14-12(17)8-11(16)9-13(14)18/h3,5,8-10H,2,4,6-7H2,1H3
39 atoms
Cl 2.373472 -0.004781 2.223778
Cl 0.107386 -0.612559 -2.589482
Cl 5.447067 -0.267444 -2.169216
O  0.16053 -0.306245 0.32994
O  -2.864911 0.985948 -1.077102
N  -2.658516 -0.75668 0.374129
N  -2.330365 1.455152 1.081046
N  -1.514449 3.249138 2.067525
C  -3.179216 -1.673446 -0.638135
C  -1.722649 -1.310671 1.336849
C  -4.694481 -1.602705 -0.777094
C  -0.350827 -1.566126 0.744406
C  -2.622447 0.561693 0.021978
C  -5.43185 -1.921893 0.51429
C  1.377119 -0.324056 -0.244609
C  -2.802529 1.438483 2.375472
C  -1.571102 2.580759 0.958469
C  2.530884 -0.181193 0.522098
C  1.519271 -0.456566 -1.623365
C  -2.287079 2.553919 2.956313
C  3.787698 -0.156337 -0.058077
C  2.765407 -0.436792 -2.227439
C  3.889789 -0.291199 -1.432544
H  -2.700246 -1.495404 -1.602868
H  -2.900221 -2.682613 -0.327224
H  -2.127414 -2.251372 1.714012
H  -1.614102 -0.653347 2.197388
H  -4.984073 -2.314089 -1.554859
H  -4.985089 -0.618847 -1.14798
H  0.294804 -2.016974 1.50585
H  -0.404679 -2.255498 -0.105403
H  -5.187244 -1.20862 1.301871
H  -6.511199 -1.886602 0.369308
H  -5.184404 -2.920137 0.881236
H  -3.479379 0.682681 2.735348
H  -1.078605 2.834339 0.033359
H  -2.439023 2.900592 3.966026
H  4.669264 -0.035953 0.554647
H  2.853414 -0.534767 -3.299752
totalener: -2276.63821726 hartree
nucrepener: 2455.40759298 hartree
electener: -4732.04581024 hartree
oneelecener: -8009.74454048 hartree
twoeener: 3277.69873023 hartree
kineticenergy: 2270.88348138 hartree
xcener: -149.626207059183 hartree
chargesum: -0.0000000
charge: -0.042768 -0.044231 -0.058247 -0.313410 -0.349121 -0.128362 -0.003864 -0.300833 -0.107917 -0.086928 -0.093827 -0.064462 0.276670 -0.260659 0.296133 -0.167961 0.062596 -0.065979 -0.035953 -0.084350 -0.084954 -0.093800 0.034313 0.111513 0.087270 0.095138 0.122895 0.069464 0.086988 0.116916 0.108454 0.076727 0.095774 0.070216 0.164414 0.139299 0.129268 0.121031 0.122548
qa: -0.0428 -0.0442 -0.0582 -0.3134 -0.3491 -0.1284 -0.0039 -0.3008 -0.1079 -0.0869 -0.0938 -0.0645 0.2767 -0.2607 0.2961 -0.1680 0.0626 -0.0660 -0.0360 -0.0844 -0.0850 -0.0938 0.0343 0.1115 0.0873 0.0951 0.1229 0.0695 0.0870 0.1169 0.1085 0.0767 0.0958 0.0702 0.1644 0.1393 0.1293 0.1210 0.1225
va: 1.2746 1.2742 1.2432 1.9846 2.1504 2.9976 3.2368 3.1323 3.9185 3.9302 3.8554 3.8851 4.3514 3.9269 3.6609 3.9021 4.0575 4.0554 4.0392 4.0815 3.9944 3.9988 3.9512 1.0191 0.9952 1.0022 1.0069 1.0125 1.0189 1.0074 0.9926 1.0074 1.0085 1.0033 0.9931 1.0097 1.0091 1.0188 1.0175
dispcorr: -0.023560174 hartree
energy: -2276.661777436427
dipole: -44.43069 44.33175 -0.09894 -11.95590 9.61198 -2.34392 10.65478 -10.32763 0.32715
magnitude: 2.36871 au
magnitude: 6.02077 debye
