program: Orca
programVersion: 4.2.1
elementType: Cl Cl Cl O O N N N C C C C C C C C C C C C C C C H H H H H H H H H H H H H H H H
charge: 0
multiplicity: 1
keywords: wb97x-d3
keywords: def2-TZVPP
keywords: def2/J RIJCOSX GRIDX6 NOFINALGRIDX
keywords: grid4 nofinalgrid
keywords: scfconv7
keywords: smallprint printgap noloewdin
keywords: NOSOSCF
formula: C15H16Cl3N3O2
InChI: InChI=1/C15H16Cl3N3O2/c1-2-4-20(15(22)21-5-3-19-10-21)6-7-23-14-12(17)8-11(16)9-13(14)18/h3,5,8-10H,2,4,6-7H2,1H3
39 atoms
Cl 1.190937 1.595722 0.664978
Cl 1.66461 -3.02757 -2.007613
Cl 5.985092 0.048041 -1.178501
O  0.243468 -0.896636 -0.586095
O  -2.301205 -0.237238 2.788344
N  -2.293885 -0.294313 0.522103
N  -2.906978 1.656625 1.687741
N  -2.939823 3.834813 1.334468
C  -2.832302 0.195151 -0.74662
C  -1.701397 -1.621456 0.551363
C  -4.353721 0.16546 -0.822419
C  -0.191214 -1.572405 0.592435
C  -2.474478 0.303137 1.723044
C  -4.949466 -1.217233 -0.603265
C  1.567019 -0.692753 -0.691093
C  -3.841239 2.181463 2.550974
C  -2.386403 2.714432 0.993633
C  2.167792 0.449316 -0.1668
C  2.381823 -1.607134 -1.354785
C  -3.858581 3.515739 2.296649
C  3.52319 0.691239 -0.31293
C  3.739392 -1.389771 -1.516376
C  4.297227 -0.238056 -0.987164
H  -2.465302 1.193597 -0.972087
H  -2.41272 -0.442042 -1.524091
H  -2.026816 -2.163665 -0.336425
H  -2.057792 -2.180448 1.416519
H  -4.635771 0.537601 -1.810816
H  -4.777435 0.873643 -0.106554
H  0.150077 -1.046348 1.488735
H  0.209856 -2.591164 0.621371
H  -6.033827 -1.19408 -0.706641
H  -4.568683 -1.938447 -1.329018
H  -4.730517 -1.600736 0.394098
H  -4.389753 1.565357 3.241545
H  -1.578325 2.602781 0.288006
H  -4.479893 4.268125 2.754903
H  3.964575 1.588302 0.096613
H  4.349038 -2.110425 -2.041858
totalener: -2276.63971893 hartree
nucrepener: 2405.11399790 hartree
electener: -4681.75371683 hartree
oneelecener: -7908.78424131 hartree
twoeener: 3227.03052449 hartree
kineticenergy: 2270.87932607 hartree
xcener: -149.627025382880 hartree
chargesum: 0.0000000
charge: -0.053041 -0.052574 -0.057251 -0.321289 -0.374176 -0.113910 -0.039562 -0.299817 -0.141684 -0.064771 -0.085020 -0.069472 0.315934 -0.267369 0.248794 -0.126967 0.028973 0.007042 -0.035405 -0.068933 -0.107117 -0.099783 0.040695 0.114172 0.102712 0.098596 0.112176 0.072828 0.079047 0.128388 0.114203 0.099108 0.078099 0.083756 0.151630 0.126128 0.129932 0.125295 0.120635
qa: -0.0530 -0.0526 -0.0573 -0.3213 -0.3742 -0.1139 -0.0396 -0.2998 -0.1417 -0.0648 -0.0850 -0.0695 0.3159 -0.2674 0.2488 -0.1270 0.0290 0.0070 -0.0354 -0.0689 -0.1071 -0.0998 0.0407 0.1142 0.1027 0.0986 0.1122 0.0728 0.0790 0.1284 0.1142 0.0991 0.0781 0.0838 0.1516 0.1261 0.1299 0.1253 0.1206
va: 1.2653 1.2623 1.2441 2.0062 2.1309 3.0603 3.2461 3.1523 3.9312 3.8907 3.8408 3.8890 4.2839 3.9212 3.8053 3.9171 4.0459 3.9769 3.9967 4.0205 4.0232 4.0167 3.9516 1.0045 1.0054 1.0057 1.0229 1.0176 1.0116 0.9966 1.0075 1.0089 1.0016 1.0041 1.0117 1.0237 1.0074 1.0161 1.0186
dispcorr: -0.022998628 hartree
energy: -2276.662717559662
dipole: -45.92382 45.80370 -0.12012 -1.35187 0.01644 -1.33543 4.37754 -5.24488 -0.86734
magnitude: 1.59690 au
magnitude: 4.05899 debye
