program: Orca
programVersion: 4.2.1
elementType: Cl Cl Cl O O N N N C C C C C C C C C C C C C C C H H H H H H H H H H H H H H H H
charge: 0
multiplicity: 1
keywords: wb97x-d3
keywords: def2-TZVPP
keywords: def2/J RIJCOSX GRIDX6 NOFINALGRIDX
keywords: grid4 nofinalgrid
keywords: scfconv7
keywords: smallprint printgap noloewdin
keywords: NOSOSCF
formula: C15H16Cl3N3O2
InChI: InChI=1/C15H16Cl3N3O2/c1-2-4-20(15(22)21-5-3-19-10-21)6-7-23-14-12(17)8-11(16)9-13(14)18/h3,5,8-10H,2,4,6-7H2,1H3
39 atoms
Cl 0.690445 1.450108 0.55463
Cl 1.839637 -3.444996 -1.304125
Cl 5.805733 -0.070815 0.000581
O  0.094341 -1.24964 -0.442646
O  -2.446571 1.558987 -1.983566
N  -2.577053 -0.113581 -0.465772
N  -3.028832 2.12477 0.134383
N  -3.069285 3.298736 2.004508
C  -3.259656 -0.69978 0.680408
C  -2.045265 -1.03493 -1.457628
C  -2.336147 -1.326318 1.716973
C  -0.552509 -0.909908 -1.667183
C  -2.663313 1.180976 -0.857021
C  -3.121806 -1.803977 2.929001
C  1.405052 -0.967842 -0.370909
C  -3.704192 3.291743 -0.146236
C  -2.659209 2.202677 1.452113
C  1.851116 0.266756 0.096019
C  2.365269 -1.91069 -0.730127
C  -3.732197 3.983342 1.021129
C  3.200132 0.554371 0.217393
C  3.72019 -1.650751 -0.615505
C  4.122867 -0.41225 -0.144889
H  -3.890538 0.054424 1.148149
H  -3.950322 -1.464064 0.306386
H  -2.539017 -0.891996 -2.421477
H  -2.2747 -2.048661 -1.127782
H  -1.571014 -0.607901 2.01809
H  -1.790487 -2.161888 1.275081
H  -0.246466 -1.600438 -2.460227
H  -0.285972 0.10199 -1.980986
H  -3.884957 -2.533006 2.650685
H  -2.467593 -2.280542 3.657705
H  -3.625471 -0.976442 3.431171
H  -4.089448 3.505967 -1.127112
H  -2.064667 1.443721 1.934187
H  -4.190791 4.940271 1.210802
H  3.521274 1.517742 0.586117
H  4.445862 -2.401201 -0.893665
totalener: -2276.64206996 hartree
nucrepener: 2434.78347507 hartree
electener: -4711.42554504 hartree
oneelecener: -7968.29543985 hartree
twoeener: 3256.86989481 hartree
kineticenergy: 2270.87352083 hartree
xcener: -149.628091970970 hartree
chargesum: -0.0000000
charge: -0.047715 -0.053757 -0.058753 -0.323842 -0.388732 -0.091679 -0.044589 -0.297267 -0.174108 -0.083317 -0.048024 -0.057756 0.314003 -0.253471 0.249369 -0.104290 -0.009665 0.014231 -0.046913 -0.083326 -0.099624 -0.094988 0.040999 0.119392 0.106752 0.114079 0.101111 0.052005 0.063406 0.108126 0.131670 0.075518 0.092869 0.084209 0.159472 0.157477 0.131493 0.125251 0.120385
qa: -0.0477 -0.0538 -0.0588 -0.3238 -0.3887 -0.0917 -0.0446 -0.2973 -0.1741 -0.0833 -0.0480 -0.0578 0.3140 -0.2535 0.2494 -0.1043 -0.0097 0.0142 -0.0469 -0.0833 -0.0996 -0.0950 0.0410 0.1194 0.1068 0.1141 0.1011 0.0520 0.0634 0.1081 0.1317 0.0755 0.0929 0.0842 0.1595 0.1575 0.1315 0.1253 0.1204
va: 1.2733 1.2624 1.2425 1.9868 2.1119 3.0687 3.2492 3.1521 3.8955 3.9161 3.8103 3.8505 4.2703 3.9578 3.7821 3.9202 4.0494 3.9901 4.0086 4.0356 4.0114 4.0101 3.9472 0.9986 0.9979 1.0185 1.0022 1.0276 1.0254 1.0093 0.9978 1.0031 1.0051 1.0037 1.0090 1.0021 1.0078 1.0162 1.0188
dispcorr: -0.023288066 hartree
energy: -2276.665358028662
dipole: -38.92272 38.72981 -0.19291 -2.54903 1.10712 -1.44191 8.91705 -9.27004 -0.35299
magnitude: 1.49697 au
magnitude: 3.80499 debye
