program: Orca
programVersion: 4.2.1
elementType: Cl Cl Cl O O N N N C C C C C C C C C C C C C C C H H H H H H H H H H H H H H H H
charge: 0
multiplicity: 1
keywords: wb97x-d3
keywords: def2-TZVPP
keywords: def2/J RIJCOSX GRIDX6 NOFINALGRIDX
keywords: grid4 nofinalgrid
keywords: scfconv7
keywords: smallprint printgap noloewdin
keywords: NOSOSCF
formula: C15H16Cl3N3O2
InChI: InChI=1/C15H16Cl3N3O2/c1-2-4-20(15(22)21-5-3-19-10-21)6-7-23-14-12(17)8-11(16)9-13(14)18/h3,5,8-10H,2,4,6-7H2,1H3
39 atoms
Cl 0.485964 1.490061 -0.018135
Cl 1.943495 -3.384086 -1.721335
Cl 5.509227 0.62636 -1.684677
O  0.096812 -1.351918 -0.67569
O  -1.266049 -0.206847 2.923106
N  -2.240655 -0.54642 0.911847
N  -2.560047 1.466268 2.111981
N  -2.670634 3.580448 2.738467
C  -2.798018 -0.036014 -0.3349
C  -1.654472 -1.875969 0.870768
C  -4.175152 -0.599961 -0.663209
C  -0.15943 -1.894953 0.621911
C  -1.974223 0.178252 2.0226
C  -4.708919 -0.028071 -1.968069
C  1.346489 -0.905441 -0.885398
C  -3.832886 1.902484 1.809102
C  -1.919008 2.527137 2.68963
C  1.688114 0.421018 -0.628702
C  2.338722 -1.743704 -1.388454
C  -3.871104 3.201374 2.20497
C  2.962191 0.904905 -0.872912
C  3.619766 -1.285115 -1.643917
C  3.918811 0.040085 -1.376613
H  -2.835461 1.051361 -0.299948
H  -2.103987 -0.28012 -1.140476
H  -2.163468 -2.444363 0.091174
H  -1.84345 -2.393782 1.811972
H  -4.873214 -0.389831 0.150883
H  -4.123982 -1.689722 -0.735179
H  0.362269 -1.321544 1.389805
H  0.195959 -2.9294 0.66874
H  -4.041529 -0.250332 -2.801911
H  -5.686385 -0.442625 -2.210844
H  -4.815073 1.056385 -1.912761
H  -4.588901 1.262052 1.392211
H  -0.900751 2.452718 3.036879
H  -4.703475 3.883973 2.141803
H  3.201447 1.938477 -0.669172
H  4.370448 -1.954032 -2.039044
totalener: -2276.64215465 hartree
nucrepener: 2424.51823116 hartree
electener: -4701.16038581 hartree
oneelecener: -7947.60102918 hartree
twoeener: 3246.44064337 hartree
kineticenergy: 2270.87678108 hartree
xcener: -149.629703444057 hartree
chargesum: -0.0000000
charge: -0.052422 -0.053123 -0.057674 -0.338479 -0.388918 -0.118907 -0.033475 -0.301402 -0.153519 -0.058285 -0.088400 -0.052724 0.306786 -0.248993 0.225808 -0.173082 0.055238 0.027234 -0.014368 -0.075754 -0.108997 -0.100593 0.042742 0.120675 0.121276 0.100565 0.109067 0.060693 0.063684 0.130406 0.104565 0.080529 0.091394 0.081842 0.170392 0.149300 0.131368 0.125436 0.120113
qa: -0.0524 -0.0531 -0.0577 -0.3385 -0.3889 -0.1189 -0.0335 -0.3014 -0.1535 -0.0583 -0.0884 -0.0527 0.3068 -0.2490 0.2258 -0.1731 0.0552 0.0272 -0.0144 -0.0758 -0.1090 -0.1006 0.0427 0.1207 0.1213 0.1006 0.1091 0.0607 0.0637 0.1304 0.1046 0.0805 0.0914 0.0818 0.1704 0.1493 0.1314 0.1254 0.1201
va: 1.2709 1.2622 1.2436 1.9916 2.1075 3.0825 3.2449 3.1449 3.8524 3.9229 3.8758 3.8378 4.2784 3.9426 3.8287 3.9035 4.0307 3.9752 3.9821 4.0755 4.0235 4.0245 3.9558 0.9915 1.0173 1.0066 1.0124 1.0158 1.0156 1.0018 1.0110 1.0039 1.0059 1.0040 0.9956 1.0116 1.0089 1.0170 1.0189
dispcorr: -0.022942473 hartree
energy: -2276.665097125458
dipole: -43.49447 42.99770 -0.49677 -0.60677 -0.71647 -1.32324 3.61562 -4.92068 -1.30506
magnitude: 1.92378 au
magnitude: 4.88986 debye
