program: Orca
programVersion: 5.0.2
elementType: Cl Cl O O N C C C C C C C C C C C C C C C C H H H H H H H H H H H H H H H H H H H H H
charge: 0
multiplicity: 1
keywords: wb97x-d3
keywords: def2-TZVPP
keywords: def2/J RIJCOSX
keywords: DEFGRID2
keywords: scfconv7
keywords: smallprint printgap noloewdin
keywords: NOSOSCF
formula: C16H21Cl2NO2
InChI: InChI=1/C16H21Cl2NO2/c1-12-5-2-3-8-19(12)9-4-10-21-16(20)13-6-7-14(17)15(18)11-13/h6-7,11-12H,2-5,8-10H2,1H3
42 atoms
Cl 4.298935 -3.191909 -0.917567
Cl 5.884476 -1.965541 1.500797
O  -0.16991 -0.529373 -0.807493
O  -0.052003 1.024342 0.797614
N  -4.10367 1.292979 -1.032464
C  -3.894876 1.987148 0.242308
C  -3.981079 3.498123 0.018562
C  -5.374437 1.629092 -1.657392
C  -5.295899 3.912889 -0.62966
C  -5.504222 3.122372 -1.912566
C  -3.945568 -0.149373 -0.955453
C  -4.812351 1.534896 1.382215
C  -2.591108 -0.610869 -0.431631
C  -1.450762 -0.0471 -1.255859
C  0.426011 0.092759 0.190792
C  1.772085 -0.458731 0.494293
C  2.339506 -1.47658 -0.264848
C  2.481584 0.081792 1.562833
C  3.607113 -1.941267 0.040592
C  3.744178 -0.386759 1.870908
C  4.312075 -1.397852 1.110573
H  -2.868271 1.778664 0.557604
H  -3.151352 3.810312 -0.623489
H  -3.841773 4.007128 0.975007
H  -6.236451 1.28457 -1.062104
H  -5.434229 1.09204 -2.607406
H  -5.293604 4.985698 -0.835151
H  -6.129967 3.731869 0.054512
H  -6.486556 3.327772 -2.342859
H  -4.762189 3.428658 -2.655586
H  -4.728723 -0.628118 -0.347838
H  -4.07609 -0.544454 -1.967614
H  -5.869852 1.687904 1.163246
H  -4.676569 0.479234 1.620862
H  -4.582791 2.098509 2.287717
H  -2.473069 -0.351581 0.622898
H  -2.572339 -1.701677 -0.486616
H  -1.449994 1.042536 -1.261062
H  -1.524975 -0.387113 -2.288334
H  1.810345 -1.913064 -1.100238
H  2.053647 0.872248 2.163516
H  4.291993 0.033952 2.702927
elementType: Cl O N C H
totalener: -1748.07710757 hartree
nucrepener: 1885.57983246 hartree
electener: -3633.65694003 hartree
oneelecener: -6143.49887861 hartree
twoeener: 2509.84193858 hartree
cpcmener: -0.01878860 hartree
kineticenergy: 1743.00311181 hartree
xcener: -123.685006078692 hartree
chargesum: 0.0000000
charge: -0.062011 -0.056301 -0.281113 -0.491727 -0.201374 0.092571 -0.174365 -0.130736 -0.121087 -0.132001 -0.131107 -0.333022 -0.128174 0.006176 0.561306 -0.011635 -0.172340 -0.164753 0.063471 -0.128130 0.046956 0.056866 0.073607 0.075421 0.077223 0.087932 0.075102 0.072950 0.074407 0.056299 0.092311 0.099402 0.092380 0.093063 0.096235 0.084545 0.092709 0.100161 0.118655 0.134228 0.148103 0.147800
qa: -0.0620 -0.0563 -0.2811 -0.4917 -0.2014 0.0926 -0.1744 -0.1307 -0.1211 -0.1320 -0.1311 -0.3330 -0.1282 0.0062 0.5613 -0.0116 -0.1723 -0.1648 0.0635 -0.1281 0.0470 0.0569 0.0736 0.0754 0.0772 0.0879 0.0751 0.0729 0.0744 0.0563 0.0923 0.0994 0.0924 0.0931 0.0962 0.0845 0.0927 0.1002 0.1187 0.1342 0.1481 0.1478
va: 1.2554 1.2640 2.1575 2.0151 2.8763 3.8976 3.9433 3.9644 3.8534 3.9071 3.9318 3.9578 3.8179 3.8118 4.0188 3.6466 4.0997 4.0472 3.9445 3.9984 3.9629 1.0151 1.0151 1.0136 0.9983 1.0021 1.0132 1.0079 1.0147 1.0217 0.9981 0.9983 0.9974 1.0010 1.0074 1.0202 1.0183 1.0270 1.0032 1.0367 1.0206 1.0061
dispcorr: -0.019892446 hartree
energy: -1748.097000015239
dipole: -78.17651 77.04755 -1.12896 34.14145 -34.29495 -0.15349 -5.79259 5.64262 -0.14996
magnitude: 1.14917 au
magnitude: 2.92097 debye
