program: Orca
programVersion: 5.0.2
elementType: Cl Cl O O N C C C C C C C C C C C C C C C C H H H H H H H H H H H H H H H H H H H H H
charge: 0
multiplicity: 1
keywords: wb97x-d3
keywords: def2-TZVPP
keywords: def2/J RIJCOSX
keywords: DEFGRID2
keywords: scfconv7
keywords: smallprint printgap noloewdin
keywords: NOSOSCF
formula: C16H21Cl2NO2
InChI: InChI=1/C16H21Cl2NO2/c1-12-5-2-3-8-19(12)9-4-10-21-16(20)13-6-7-14(17)15(18)11-13/h6-7,11-12H,2-5,8-10H2,1H3
42 atoms
Cl 3.198917 1.207519 -0.634123
Cl 5.114691 -0.176918 1.430577
O  -1.049853 -1.756136 -0.401718
O  -0.852327 -3.207078 1.290535
N  -3.031466 0.913867 -0.7087
C  -2.133325 2.068659 -0.732106
C  -2.120719 2.673339 -2.136129
C  -4.391606 1.235421 -1.106387
C  -3.520846 3.037515 -2.615224
C  -4.440059 1.828433 -2.505134
C  -2.988496 0.185891 0.544833
C  -2.416647 3.129559 0.335133
C  -3.318392 -1.296838 0.403514
C  -2.447133 -2.041524 -0.589397
C  -0.398157 -2.332613 0.588267
C  0.974051 -1.787263 0.757267
C  1.406523 -0.672943 0.045449
C  1.827145 -2.394039 1.673987
C  2.681685 -0.175447 0.2498
C  3.10169 -1.899096 1.874207
C  3.532165 -0.787555 1.165267
H  -1.129104 1.677033 -0.534114
H  -1.68168 1.95054 -2.830304
H  -1.469172 3.550125 -2.145206
H  -4.875709 1.92822 -0.39766
H  -4.988234 0.320785 -1.083997
H  -3.48421 3.398864 -3.645725
H  -3.922893 3.8600 -2.015637
H  -5.470323 2.099207 -2.744553
H  -4.135296 1.068431 -3.230552
H  -1.985151 0.283371 0.967644
H  -3.665936 0.614442 1.299091
H  -3.388864 3.609398 0.212396
H  -2.382295 2.708689 1.3413
H  -1.658582 3.913437 0.289466
H  -3.250402 -1.756203 1.392472
H  -4.352799 -1.439472 0.08012
H  -2.650645 -1.718771 -1.60648
H  -2.623307 -3.116416 -0.540052
H  0.759549 -0.178129 -0.665588
H  1.50553 -3.260289 2.235333
H  3.763895 -2.374706 2.584461
elementType: Cl O N C H
totalener: -1748.07599044 hartree
nucrepener: 1973.97531753 hartree
electener: -3722.05130797 hartree
oneelecener: -6320.00944652 hartree
twoeener: 2597.95813855 hartree
cpcmener: -0.01963550 hartree
kineticenergy: 1743.01452247 hartree
xcener: -123.685613409230 hartree
chargesum: -0.0000000
charge: -0.059723 -0.056473 -0.277548 -0.482715 -0.198134 0.110308 -0.165989 -0.129588 -0.121423 -0.144010 -0.104294 -0.332631 -0.136306 -0.015391 0.524684 0.007921 -0.165617 -0.174637 0.054254 -0.119475 0.041194 0.042386 0.069882 0.074287 0.080136 0.093775 0.074743 0.072945 0.072915 0.060128 0.094989 0.091094 0.088664 0.093724 0.095894 0.091443 0.087056 0.109408 0.114513 0.144183 0.145188 0.148240
qa: -0.0597 -0.0565 -0.2775 -0.4827 -0.1981 0.1103 -0.1660 -0.1296 -0.1214 -0.1440 -0.1043 -0.3326 -0.1363 -0.0154 0.5247 0.0079 -0.1656 -0.1746 0.0543 -0.1195 0.0412 0.0424 0.0699 0.0743 0.0801 0.0938 0.0747 0.0729 0.0729 0.0601 0.0950 0.0911 0.0887 0.0937 0.0959 0.0914 0.0871 0.1094 0.1145 0.1442 0.1452 0.1482
va: 1.2613 1.2640 2.1349 2.0204 2.8540 3.9445 3.9215 3.9452 3.8523 3.9303 3.9045 3.9434 3.8075 3.8581 4.0911 3.6164 4.0613 4.0669 3.9811 3.9902 3.9644 1.0002 1.0190 1.0132 1.0024 1.0006 1.0133 1.0074 1.0156 1.0179 0.9954 1.0052 0.9982 1.0023 1.0081 1.0252 1.0148 1.0137 1.0116 1.0226 1.0205 1.0052
dispcorr: -0.021355144 hartree
energy: -1748.097345583542
dipole: -58.83988 57.89323 -0.94664 14.80940 -14.36090 0.44850 -11.25087 11.12133 -0.12954
magnitude: 1.05550 au
magnitude: 2.68286 debye
