program: Orca
programVersion: 5.0.2
elementType: Cl Cl O O N C C C C C C C C C C C C C C C C H H H H H H H H H H H H H H H H H H H H H
charge: 0
multiplicity: 1
keywords: wb97x-d3
keywords: def2-TZVPP
keywords: def2/J RIJCOSX
keywords: DEFGRID2
keywords: scfconv7
keywords: smallprint printgap noloewdin
keywords: NOSOSCF
formula: C16H21Cl2NO2
InChI: InChI=1/C16H21Cl2NO2/c1-12-5-2-3-8-19(12)9-4-10-21-16(20)13-6-7-14(17)15(18)11-13/h6-7,11-12H,2-5,8-10H2,1H3
42 atoms
Cl 3.824109 -0.42592 2.367029
Cl 4.604611 0.593655 -0.495613
O  -1.454476 -2.082348 -0.588267
O  -1.064959 -2.282407 1.603725
N  -2.794669 0.639543 -0.951787
C  -2.458452 1.262151 0.332536
C  -1.186862 2.098533 0.18122
C  -2.969111 1.615635 -2.016256
C  -1.304025 3.13634 -0.926443
C  -1.718271 2.45392 -2.221762
C  -3.933053 -0.261934 -0.897318
C  -3.586106 2.079405 0.971247
C  -3.779798 -1.471954 0.015345
C  -2.812461 -2.536703 -0.464376
C  -0.71677 -1.949947 0.492771
C  0.607284 -1.339067 0.203803
C  1.498099 -1.187006 1.259829
C  0.960409 -0.888243 -1.065598
C  2.728772 -0.591593 1.050616
C  2.191667 -0.295185 -1.27456
C  3.078295 -0.142906 -0.219495
H  -2.219231 0.45724 1.033006
H  -0.346464 1.434104 -0.03987
H  -0.961268 2.575323 1.138122
H  -3.830006 2.281643 -1.838793
H  -3.196087 1.073457 -2.937793
H  -0.354696 3.661422 -1.053616
H  -2.04379 3.896639 -0.658441
H  -1.903266 3.187597 -3.009505
H  -0.90569 1.809874 -2.573297
H  -4.859892 0.260373 -0.612837
H  -4.107664 -0.628249 -1.913703
H  -4.464837 1.468896 1.183971
H  -3.248043 2.492504 1.922937
H  -3.911934 2.916264 0.351931
H  -3.56725 -1.179543 1.045393
H  -4.753747 -1.967915 0.052386
H  -3.077882 -2.856557 -1.47138
H  -2.851452 -3.414061 0.183462
H  1.236333 -1.529006 2.251952
H  0.284024 -0.983592 -1.902563
H  2.462917 0.055508 -2.260573
elementType: Cl O N C H
totalener: -1748.07458034 hartree
nucrepener: 2042.41927427 hartree
electener: -3790.49385461 hartree
oneelecener: -6457.38751331 hartree
twoeener: 2666.89365871 hartree
cpcmener: -0.02111413 hartree
kineticenergy: 1743.01460549 hartree
xcener: -123.688439492513 hartree
chargesum: -0.0000000
charge: -0.062230 -0.056238 -0.266156 -0.485704 -0.189424 0.081632 -0.161130 -0.134493 -0.118809 -0.137373 -0.116541 -0.334003 -0.125943 -0.001169 0.522361 0.020342 -0.128503 -0.254388 0.055035 -0.088598 0.046143 0.063664 0.054041 0.081001 0.078743 0.086953 0.074038 0.074497 0.076080 0.056931 0.090912 0.089800 0.094894 0.095510 0.092946 0.084052 0.096434 0.110073 0.115248 0.124688 0.146242 0.148442
qa: -0.0622 -0.0562 -0.2662 -0.4857 -0.1894 0.0816 -0.1611 -0.1345 -0.1188 -0.1374 -0.1165 -0.3340 -0.1259 -0.0012 0.5224 0.0203 -0.1285 -0.2544 0.0550 -0.0886 0.0461 0.0637 0.0540 0.0810 0.0787 0.0870 0.0740 0.0745 0.0761 0.0569 0.0909 0.0898 0.0949 0.0955 0.0929 0.0841 0.0964 0.1101 0.1152 0.1247 0.1462 0.1484
va: 1.2544 1.2637 2.1444 2.0115 2.8677 3.8982 3.9373 3.9530 3.8618 3.9104 3.9286 3.9626 3.8198 3.8554 4.0685 3.5343 4.0909 4.0522 3.9679 3.9472 3.9626 1.0007 1.0256 1.0150 0.9995 1.0028 1.0136 1.0079 1.0161 1.0190 0.9983 0.9994 1.0007 1.0074 0.9978 1.0190 1.0161 1.0003 1.0101 1.0427 1.0262 1.0040
dispcorr: -0.024031170 hartree
energy: -1748.098611508222
dipole: -55.69338 54.16639 -1.52699 14.62359 -14.35099 0.27260 -13.08308 11.54886 -1.53422
magnitude: 2.18171 au
magnitude: 5.54546 debye
