program: Orca
programVersion: 5.0.2
elementType: Cl Cl O O N C C C C C C C C C C C C C C C C H H H H H H H H H H H H H H H H H H H H H
charge: 0
multiplicity: 1
keywords: wb97x-d3
keywords: def2-TZVPP
keywords: def2/J RIJCOSX
keywords: DEFGRID2
keywords: scfconv7
keywords: smallprint printgap noloewdin
keywords: NOSOSCF
formula: C16H21Cl2NO2
InChI: InChI=1/C16H21Cl2NO2/c1-12-5-2-3-8-19(12)9-4-10-21-16(20)13-6-7-14(17)15(18)11-13/h6-7,11-12H,2-5,8-10H2,1H3
42 atoms
Cl 4.220997 -1.661545 -1.742847
Cl 5.988119 -1.895377 0.840608
O  -0.457227 -0.467601 0.184658
O  -0.326154 -0.326779 2.408631
N  -4.483811 1.301461 -1.242488
C  -4.53572 1.874949 0.103047
C  -5.381917 3.148472 0.084824
C  -3.933978 2.242802 -2.205927
C  -4.87753 4.161922 -0.930789
C  -4.76373 3.511107 -2.299673
C  -3.875757 -0.012538 -1.378299
C  -5.102774 0.909498 1.133493
C  -2.35564 -0.168513 -1.217505
C  -1.862855 -0.147626 0.21249
C  0.188931 -0.524979 1.331547
C  1.626735 -0.863092 1.169887
C  2.192973 -1.080422 -0.081721
C  2.417473 -0.963983 2.310549
C  3.536287 -1.397029 -0.186565
C  3.758225 -1.280664 2.205381
C  4.321763 -1.499503 0.957484
H  -3.527363 2.175403 0.439096
H  -5.376119 3.582654 1.087561
H  -6.420957 2.883787 -0.138419
H  -3.89748 1.75151 -3.181561
H  -2.896711 2.526624 -1.962055
H  -3.892498 4.526952 -0.620993
H  -5.53673 5.03213 -0.964774
H  -5.759498 3.273183 -2.684679
H  -4.299894 4.190745 -3.018234
H  -4.379976 -0.713968 -0.710914
H  -4.112543 -0.357842 -2.387798
H  -4.462236 0.048836 1.321683
H  -5.222742 1.427029 2.086133
H  -6.084612 0.538435 0.833409
H  -2.095999 -1.13777 -1.652299
H  -1.827645 0.585905 -1.805667
H  -2.387584 -0.892117 0.815539
H  -1.990664 0.828759 0.680826
H  1.601734 -1.007764 -0.98355
H  1.993659 -0.796765 3.29071
H  4.369233 -1.359389 3.093697
elementType: Cl O N C H
totalener: -1748.07753193 hartree
nucrepener: 1871.90243469 hartree
electener: -3619.97996661 hartree
oneelecener: -6115.42811318 hartree
twoeener: 2495.44814657 hartree
cpcmener: -0.02145139 hartree
kineticenergy: 1743.01032587 hartree
xcener: -123.683531066509 hartree
chargesum: 0.0000000
charge: -0.061039 -0.056218 -0.278716 -0.489862 -0.192067 0.013917 -0.168836 -0.106155 -0.107131 -0.135434 -0.139458 -0.289480 -0.133052 0.033339 0.538673 -0.001679 -0.173125 -0.155591 0.062307 -0.131295 0.047163 0.061314 0.076280 0.063514 0.092181 0.076971 0.065541 0.073998 0.056109 0.074181 0.103546 0.102841 0.092828 0.092138 0.087474 0.085683 0.084033 0.104134 0.101961 0.135093 0.146367 0.147555
qa: -0.0610 -0.0562 -0.2787 -0.4899 -0.1921 0.0139 -0.1688 -0.1062 -0.1071 -0.1354 -0.1395 -0.2895 -0.1331 0.0333 0.5387 -0.0017 -0.1731 -0.1556 0.0623 -0.1313 0.0472 0.0613 0.0763 0.0635 0.0922 0.0770 0.0655 0.0740 0.0561 0.0742 0.1035 0.1028 0.0928 0.0921 0.0875 0.0857 0.0840 0.1041 0.1020 0.1351 0.1464 0.1476
va: 1.2569 1.2641 2.1598 2.0173 2.9188 3.9085 3.9085 3.9288 3.8567 3.9147 3.9837 3.8949 3.8062 3.8001 4.0428 3.6665 4.0994 4.0434 3.9472 4.0002 3.9606 1.0032 1.0162 1.0227 0.9986 1.0008 1.0163 1.0132 1.0232 1.0153 0.9925 1.0009 1.0043 1.0071 1.0138 1.0188 1.0087 1.0004 1.0016 1.0330 1.0209 1.0060
dispcorr: -0.019321822 hartree
energy: -1748.096853751013
dipole: -75.64052 75.20746 -0.43307 30.10962 -29.86896 0.24066 -4.82529 4.46987 -0.35543
magnitude: 0.60975 au
magnitude: 1.54985 debye
