program: Orca
programVersion: 5.0.2
elementType: Cl Cl O O N C C C C C C C C C C C C C C C C H H H H H H H H H H H H H H H H H H H H H
charge: 0
multiplicity: 1
keywords: wb97x-d3
keywords: def2-TZVPP
keywords: def2/J RIJCOSX
keywords: DEFGRID2
keywords: scfconv7
keywords: smallprint printgap noloewdin
keywords: NOSOSCF
formula: C16H21Cl2NO2
InChI: InChI=1/C16H21Cl2NO2/c1-12-5-2-3-8-19(12)9-4-10-21-16(20)13-6-7-14(17)15(18)11-13/h6-7,11-12H,2-5,8-10H2,1H3
42 atoms
Cl 4.270265 -1.659389 1.906139
Cl 4.798259 0.88825 0.151415
O  -1.318759 -1.449326 -0.941991
O  -0.752489 -2.779342 0.765043
N  -3.426801 0.994128 -0.895907
C  -2.53588 1.527592 0.139415
C  -1.617801 2.584471 -0.476796
C  -4.22272 2.034042 -1.533353
C  -2.395996 3.704383 -1.151908
C  -3.356737 3.107854 -2.169875
C  -4.287942 -0.081737 -0.441902
C  -3.238272 2.059903 1.392174
C  -3.578308 -1.335687 0.049033
C  -2.652905 -1.987127 -0.968087
C  -0.487396 -1.89646 -0.01895
C  0.823562 -1.197741 -0.03458
C  1.819792 -1.677904 0.80835
C  1.069189 -0.079649 -0.826126
C  3.047806 -1.045964 0.862012
C  2.293783 0.559767 -0.762692
C  3.284547 0.081137 0.080715
H  -1.893754 0.707061 0.468579
H  -0.974305 2.106683 -1.221112
H  -0.956238 2.978507 0.298016
H  -4.928981 2.506379 -0.830819
H  -4.838704 1.562493 -2.303148
H  -1.71074 4.404962 -1.634061
H  -2.955229 4.281451 -0.40926
H  -4.000651 3.87698 -2.601614
H  -2.788113 2.670918 -2.996198
H  -4.988686 0.24304 0.343533
H  -4.916377 -0.370109 -1.289812
H  -2.497077 2.459497 2.086186
H  -3.949083 2.858927 1.179553
H  -3.777075 1.272589 1.921297
H  -3.054799 -1.161329 0.992243
H  -4.358949 -2.062776 0.284819
H  -3.003758 -1.811144 -1.984127
H  -2.608519 -3.065858 -0.820298
H  1.641431 -2.547683 1.425447
H  0.312128 0.309295 -1.491385
H  2.481087 1.43592 -1.367627
elementType: Cl O N C H
totalener: -1748.07544392 hartree
nucrepener: 1987.53201690 hartree
electener: -3735.60746082 hartree
oneelecener: -6347.12948579 hartree
twoeener: 2611.52202497 hartree
cpcmener: -0.02133084 hartree
kineticenergy: 1743.01654374 hartree
xcener: -123.686850422725 hartree
chargesum: 0.0000000
charge: -0.062390 -0.056322 -0.273979 -0.484673 -0.195125 0.090225 -0.168629 -0.130508 -0.124377 -0.133316 -0.122920 -0.339556 -0.121102 -0.009304 0.529644 0.012262 -0.138724 -0.237706 0.052068 -0.115243 0.056924 0.051420 0.066724 0.081367 0.077660 0.087462 0.075665 0.075119 0.075275 0.056970 0.089475 0.093578 0.096376 0.094440 0.094624 0.085637 0.096251 0.114693 0.113895 0.125757 0.174282 0.146085
qa: -0.0624 -0.0563 -0.2740 -0.4847 -0.1951 0.0902 -0.1686 -0.1305 -0.1244 -0.1333 -0.1229 -0.3396 -0.1211 -0.0093 0.5296 0.0123 -0.1387 -0.2377 0.0521 -0.1152 0.0569 0.0514 0.0667 0.0814 0.0777 0.0875 0.0757 0.0751 0.0753 0.0570 0.0895 0.0936 0.0964 0.0944 0.0946 0.0856 0.0963 0.1147 0.1139 0.1258 0.1743 0.1461
va: 1.2540 1.2641 2.1461 2.0170 2.8724 3.9021 3.9351 3.9569 3.8736 3.9081 3.9488 3.9677 3.7968 3.8333 4.0869 3.6080 4.1004 4.0464 3.9701 3.9892 3.9569 1.0072 1.0194 1.0124 0.9987 1.0024 1.0131 1.0080 1.0147 1.0217 1.0013 0.9981 1.0071 0.9977 0.9997 1.0162 1.0112 1.0030 1.0157 1.0419 1.0039 1.0073
dispcorr: -0.022348090 hartree
energy: -1748.097792007562
dipole: -62.33185 60.79258 -1.53928 21.29747 -20.22670 1.07076 -11.42492 10.49491 -0.93001
magnitude: 2.09304 au
magnitude: 5.32008 debye
