program: Orca
programVersion: 5.0.2
elementType: Cl Cl O O N C C C C C C C C C C C C C C C C H H H H H H H H H H H H H H H H H H H H H
charge: 0
multiplicity: 1
keywords: wb97x-d3
keywords: def2-TZVPP
keywords: def2/J RIJCOSX
keywords: DEFGRID2
keywords: scfconv7
keywords: smallprint printgap noloewdin
keywords: NOSOSCF
formula: C16H21Cl2NO2
InChI: InChI=1/C16H21Cl2NO2/c1-12-5-2-3-8-19(12)9-4-10-21-16(20)13-6-7-14(17)15(18)11-13/h6-7,11-12H,2-5,8-10H2,1H3
42 atoms
Cl 3.645852 -0.034533 2.355903
Cl 4.493838 0.69354 -0.577112
O  -1.472354 -2.184774 -0.558996
O  -1.090533 -2.254035 1.641889
N  -2.737785 0.577535 -0.87606
C  -2.531356 1.292134 0.385715
C  -1.188265 2.023337 0.339706
C  -2.726524 1.46529 -2.026331
C  -1.082091 2.958958 -0.857504
C  -1.400821 2.20174 -2.139102
C  -3.888048 -0.308891 -0.886118
C  -3.665449 2.242386 0.786452
C  -3.785256 -1.515031 0.041462
C  -2.837725 -2.610292 -0.410232
C  -0.73868 -1.986737 0.514489
C  0.580608 -1.378806 0.197703
C  1.419639 -1.060788 1.259237
C  0.966042 -1.062749 -1.102366
C  2.626834 -0.427774 1.026513
C  2.173488 -0.430303 -1.33482
C  3.005114 -0.106287 -0.273544
H  -2.454607 0.539744 1.175655
H  -0.382757 1.284359 0.292492
H  -1.049182 2.574516 1.27306
H  -3.552113 2.196063 -2.009063
H  -2.880433 0.860557 -2.923438
H  -0.080838 3.392616 -0.907991
H  -1.775306 3.797787 -0.7446
H  -1.437078 2.881307 -2.993716
H  -0.605998 1.477345 -2.34403
H  -4.826078 0.218992 -0.655052
H  -4.00893 -0.678627 -1.908671
H  -4.621567 1.725009 0.876995
H  -3.449955 2.683815 1.760814
H  -3.802882 3.063822 0.082409
H  -3.579397 -1.215114 1.070123
H  -4.770962 -1.987809 0.071537
H  -3.114507 -2.956498 -1.405225
H  -2.887644 -3.466205 0.265206
H  1.131875 -1.294557 2.275166
H  0.333024 -1.292903 -1.946938
H  2.467554 -0.180666 -2.344782
elementType: Cl O N C H
totalener: -1748.07330496 hartree
nucrepener: 2056.30666230 hartree
electener: -3804.37996725 hartree
oneelecener: -6485.27389967 hartree
twoeener: 2680.89393242 hartree
cpcmener: -0.02087674 hartree
kineticenergy: 1743.01163631 hartree
xcener: -123.688324454995 hartree
chargesum: -0.0000000
charge: -0.061870 -0.055876 -0.266668 -0.485596 -0.198307 0.102671 -0.153179 -0.129717 -0.121438 -0.143400 -0.115540 -0.335988 -0.127047 0.001556 0.513479 0.019639 -0.128741 -0.260451 0.061895 -0.087741 0.044343 0.065405 0.041139 0.080836 0.078440 0.085774 0.073791 0.076571 0.078607 0.057474 0.090199 0.087280 0.096607 0.095410 0.090211 0.084062 0.095450 0.109032 0.115436 0.123397 0.154374 0.148483
qa: -0.0619 -0.0559 -0.2667 -0.4856 -0.1983 0.1027 -0.1532 -0.1297 -0.1214 -0.1434 -0.1155 -0.3360 -0.1270 0.0016 0.5135 0.0196 -0.1287 -0.2605 0.0619 -0.0877 0.0443 0.0654 0.0411 0.0808 0.0784 0.0858 0.0738 0.0766 0.0786 0.0575 0.0902 0.0873 0.0966 0.0954 0.0902 0.0841 0.0954 0.1090 0.1154 0.1234 0.1544 0.1485
va: 1.2547 1.2644 2.1386 2.0130 2.8685 3.8874 3.9383 3.9523 3.8594 3.9115 3.9302 3.9579 3.8185 3.8497 4.0866 3.5467 4.0647 4.0532 3.9586 3.9340 3.9608 1.0022 1.0320 1.0146 0.9980 1.0034 1.0134 1.0072 1.0164 1.0178 1.0008 0.9994 1.0020 1.0073 0.9970 1.0207 1.0178 1.0004 1.0090 1.0430 1.0167 1.0038
dispcorr: -0.024528692 hartree
energy: -1748.097833647168
dipole: -53.85799 52.37941 -1.47858 12.36418 -12.24811 0.11607 -12.89881 11.28771 -1.61110
magnitude: 2.18983 au
magnitude: 5.56609 debye
