program: Orca
programVersion: 5.0.2
elementType: Cl Cl O O N C C C C C C C C C C C C C C C C H H H H H H H H H H H H H H H H H H H H H
charge: 0
multiplicity: 1
keywords: wb97x-d3
keywords: def2-TZVPP
keywords: def2/J RIJCOSX
keywords: DEFGRID2
keywords: scfconv7
keywords: smallprint printgap noloewdin
keywords: NOSOSCF
formula: C16H21Cl2NO2
InChI: InChI=1/C16H21Cl2NO2/c1-12-5-2-3-8-19(12)9-4-10-21-16(20)13-6-7-14(17)15(18)11-13/h6-7,11-12H,2-5,8-10H2,1H3
42 atoms
Cl 4.274264 0.533922 -0.84721
Cl 4.810348 -0.410012 2.099199
O  -1.326513 -2.057095 0.239038
O  -0.58635 -1.332245 -1.749731
N  -3.101205 0.699665 -0.268349
C  -2.154573 1.810688 -0.19955
C  -1.921789 2.360246 -1.606724
C  -4.379994 1.060549 -0.852892
C  -3.224308 2.766297 -2.285296
C  -4.210718 1.606774 -2.26241
C  -3.238229 -0.024845 0.97805
C  -2.53577 2.918065 0.787749
C  -3.598498 -1.495516 0.782714
C  -2.691585 -2.220347 -0.188352
C  -0.418597 -1.554627 -0.572381
C  0.869983 -1.292928 0.122573
C  1.858544 -0.609101 -0.576385
C  1.10963 -1.7002 1.432086
C  3.070665 -0.329015 0.028396
C  2.326454 -1.431453 2.031628
C  3.308785 -0.743519 1.335695
H  -1.206504 1.383703 0.146603
H  -1.427771 1.589155 -2.206206
H  -1.232239 3.206869 -1.554713
H  -4.924822 1.795655 -0.236418
H  -5.013056 0.170752 -0.88669
H  -3.030522 3.082885 -3.312133
H  -3.661149 3.62989 -1.775698
H  -5.184299 1.917906 -2.647827
H  -3.851773 0.807118 -2.917243
H  -2.287449 0.034595 1.513463
H  -3.984629 0.426609 1.650094
H  -2.670166 2.526249 1.79744
H  -1.742913 3.666366 0.83593
H  -3.455223 3.435513 0.512073
H  -3.582206 -1.987649 1.758467
H  -4.618572 -1.605979 0.405945
H  -2.822042 -1.847821 -1.201565
H  -2.898383 -3.29104 -0.192266
H  1.685959 -0.283297 -1.593007
H  0.361955 -2.234743 1.999254
H  2.512723 -1.754673 3.046283
elementType: Cl O N C H
totalener: -1748.07416814 hartree
nucrepener: 1997.04728559 hartree
electener: -3745.12145373 hartree
oneelecener: -6366.77358558 hartree
twoeener: 2621.65213185 hartree
cpcmener: -0.02160446 hartree
kineticenergy: 1743.01508161 hartree
xcener: -123.687244682730 hartree
chargesum: -0.0000000
charge: -0.061990 -0.056677 -0.274054 -0.481760 -0.199872 0.113968 -0.176301 -0.129439 -0.114676 -0.146918 -0.112132 -0.330997 -0.111652 -0.003802 0.529548 -0.015143 -0.134754 -0.198353 0.050878 -0.112395 0.051423 0.047647 0.069279 0.076054 0.080149 0.095265 0.074961 0.071573 0.073652 0.061635 0.093559 0.087699 0.094737 0.095803 0.088953 0.085548 0.075195 0.096234 0.119481 0.127240 0.153469 0.146962
qa: -0.0620 -0.0567 -0.2741 -0.4818 -0.1999 0.1140 -0.1763 -0.1294 -0.1147 -0.1469 -0.1121 -0.3310 -0.1117 -0.0038 0.5295 -0.0151 -0.1348 -0.1984 0.0509 -0.1124 0.0514 0.0476 0.0693 0.0761 0.0801 0.0953 0.0750 0.0716 0.0737 0.0616 0.0936 0.0877 0.0947 0.0958 0.0890 0.0855 0.0752 0.0962 0.1195 0.1272 0.1535 0.1470
va: 1.2552 1.2633 2.1390 2.0169 2.8271 3.9087 3.9371 3.9462 3.8476 3.9311 3.9171 3.9532 3.8523 3.8289 4.0658 3.6052 4.0783 4.0555 3.9733 3.9755 3.9573 1.0001 1.0207 1.0136 1.0026 0.9970 1.0134 1.0072 1.0154 1.0171 0.9996 1.0060 1.0016 1.0075 0.9978 1.0172 1.0147 1.0350 1.0028 1.0401 1.0165 1.0053
dispcorr: -0.022409888 hartree
energy: -1748.096578029894
dipole: -62.22259 60.65183 -1.57075 14.15701 -14.53498 -0.37797 -6.21092 7.80989 1.59897
magnitude: 2.27307 au
magnitude: 5.77767 debye
