program: Orca
programVersion: 5.0.2
elementType: Cl Cl O O N C C C C C C C C C C C C C C C C H H H H H H H H H H H H H H H H H H H H H
charge: 0
multiplicity: 1
keywords: wb97x-d3
keywords: def2-TZVPP
keywords: def2/J RIJCOSX
keywords: DEFGRID2
keywords: scfconv7
keywords: smallprint printgap noloewdin
keywords: NOSOSCF
formula: C16H21Cl2NO2
InChI: InChI=1/C16H21Cl2NO2/c1-12-5-2-3-8-19(12)9-4-10-21-16(20)13-6-7-14(17)15(18)11-13/h6-7,11-12H,2-5,8-10H2,1H3
42 atoms
Cl 3.918298 0.164932 2.182552
Cl 5.614449 -1.09301 -0.139756
O  -0.868304 -1.554877 1.148543
O  -0.86692 -2.579285 -0.844879
N  -3.056964 1.770972 -0.480032
C  -4.461925 2.032389 -0.149319
C  -4.740464 3.53083 -0.267969
C  -2.70378 2.233835 -1.814383
C  -4.387218 4.079475 -1.643173
C  -2.947973 3.722868 -1.982732
C  -2.653438 0.384849 -0.318668
C  -5.479008 1.208174 -0.941191
C  -2.858002 -0.160392 1.087095
C  -2.302581 -1.55627 1.275359
C  -0.288535 -2.024968 0.061205
C  1.179404 -1.79272 0.056743
C  1.801897 -1.022769 1.033399
C  1.936594 -2.34268 -0.973043
C  3.167395 -0.803413 0.97466
C  3.300864 -2.130328 -1.026673
C  3.920366 -1.358506 -0.055318
H  -4.594483 1.774082 0.904503
H  -4.156076 4.060884 0.489716
H  -5.79158 3.716425 -0.034646
H  -3.24395 1.684614 -2.602865
H  -1.644107 2.020204 -1.974935
H  -4.53116 5.161627 -1.666342
H  -5.057639 3.662668 -2.400469
H  -2.705734 4.011137 -3.00836
H  -2.267356 4.277182 -1.329636
H  -3.150247 -0.286912 -1.036808
H  -1.588926 0.349085 -0.564075
H  -5.442801 1.400136 -2.014027
H  -5.33778 0.136109 -0.796012
H  -6.488636 1.444824 -0.601979
H  -2.414819 0.512456 1.82492
H  -3.921961 -0.230379 1.326386
H  -2.749953 -2.263871 0.578305
H  -2.502473 -1.90701 2.286393
H  1.236952 -0.579549 1.840997
H  1.469886 -2.943086 -1.741042
H  3.885932 -2.562023 -1.826642
elementType: Cl O N C H
totalener: -1748.07751591 hartree
nucrepener: 1907.84549376 hartree
electener: -3655.92300967 hartree
oneelecener: -6187.79051149 hartree
twoeener: 2531.86750182 hartree
cpcmener: -0.02103843 hartree
kineticenergy: 1743.02860228 hartree
xcener: -123.688703859953 hartree
chargesum: 0.0000000
charge: -0.061490 -0.056525 -0.280715 -0.480715 -0.181808 0.076641 -0.162440 -0.127290 -0.128958 -0.130547 -0.154363 -0.330064 -0.058854 -0.017085 0.528426 -0.009118 -0.157103 -0.173075 0.062741 -0.117597 0.039158 0.070213 0.069255 0.074397 0.081162 0.087823 0.074622 0.073287 0.072120 0.057237 0.079089 0.097765 0.091195 0.092519 0.095078 0.072762 0.077538 0.106315 0.119552 0.133874 0.146482 0.148490
qa: -0.0615 -0.0565 -0.2807 -0.4807 -0.1818 0.0766 -0.1624 -0.1273 -0.1290 -0.1305 -0.1544 -0.3301 -0.0589 -0.0171 0.5284 -0.0091 -0.1571 -0.1731 0.0627 -0.1176 0.0392 0.0702 0.0693 0.0744 0.0812 0.0878 0.0746 0.0733 0.0721 0.0572 0.0791 0.0978 0.0912 0.0925 0.0951 0.0728 0.0775 0.1063 0.1196 0.1339 0.1465 0.1485
va: 1.2560 1.2637 2.1377 2.0220 2.9632 3.9489 3.9042 3.9523 3.8653 3.9043 3.9814 3.9348 3.7774 3.8741 4.0841 3.6356 4.0894 4.0610 3.9505 3.9871 3.9657 1.0016 1.0215 1.0135 0.9999 1.0039 1.0128 1.0076 1.0156 1.0208 0.9971 0.9974 0.9980 1.0018 1.0080 1.0280 1.0182 1.0181 0.9995 1.0380 1.0203 1.0049
dispcorr: -0.019737292 hartree
energy: -1748.097253205636
dipole: -69.83141 68.71186 -1.11955 23.31627 -23.31368 0.00259 -14.41898 14.59408 0.17510
magnitude: 1.13317 au
magnitude: 2.88028 debye
