program: Orca
programVersion: 5.0.2
elementType: Cl Cl O O N C C C C C C C C C C C C C C C C H H H H H H H H H H H H H H H H H H H H H
charge: 0
multiplicity: 1
keywords: wb97x-d3
keywords: def2-TZVPP
keywords: def2/J RIJCOSX
keywords: DEFGRID2
keywords: scfconv7
keywords: smallprint printgap noloewdin
keywords: NOSOSCF
formula: C16H21Cl2NO2
InChI: InChI=1/C16H21Cl2NO2/c1-12-5-2-3-8-19(12)9-4-10-21-16(20)13-6-7-14(17)15(18)11-13/h6-7,11-12H,2-5,8-10H2,1H3
42 atoms
Cl 4.7703 -2.020829 1.861197
Cl 5.449096 -0.381344 -0.728794
O  -1.094259 -1.209808 -0.194204
O  -0.535231 -2.015072 1.812686
N  -3.401177 1.546214 -0.45724
C  -4.853875 1.747868 -0.420566
C  -5.219721 2.561512 0.821583
C  -2.661621 2.799208 -0.479765
C  -4.473282 3.889042 0.874375
C  -2.975834 3.646424 0.743365
C  -2.965271 0.624233 -1.489988
C  -5.455601 2.373845 -1.684537
C  -3.236459 -0.840143 -1.158781
C  -2.503372 -1.357326 0.057907
C  -0.231274 -1.538854 0.742233
C  1.171061 -1.252074 0.339246
C  2.195953 -1.704788 1.162113
C  1.478493 -0.531553 -0.812106
C  3.514783 -1.444582 0.835723
C  2.796531 -0.264142 -1.132779
C  3.817727 -0.719521 -0.313176
H  -5.310978 0.76029 -0.303793
H  -4.979653 1.977385 1.715504
H  -6.300394 2.724587 0.837855
H  -2.848828 3.388815 -1.392448
H  -1.594577 2.562315 -0.489266
H  -4.696778 4.411181 1.807477
H  -4.811837 4.545369 0.066703
H  -2.431862 4.591584 0.675853
H  -2.609608 3.132772 1.637743
H  -3.407765 0.843582 -2.471796
H  -1.890595 0.760307 -1.629728
H  -5.287284 1.75992 -2.570859
H  -6.536817 2.471468 -1.568239
H  -5.059614 3.368346 -1.895668
H  -4.302485 -1.010091 -0.989464
H  -2.972468 -1.447448 -2.028667
H  -2.732901 -2.410787 0.228519
H  -2.772037 -0.800324 0.955864
H  1.972404 -2.265564 2.059523
H  0.702379 -0.162855 -1.46731
H  3.032384 0.301741 -2.023361
elementType: Cl O N C H
totalener: -1748.07622745 hartree
nucrepener: 1904.95060175 hartree
electener: -3653.02682920 hartree
oneelecener: -6181.92651426 hartree
twoeener: 2528.89968506 hartree
cpcmener: -0.02130752 hartree
kineticenergy: 1742.99778306 hartree
xcener: -123.682446742895 hartree
chargesum: -0.0000000
charge: -0.062411 -0.056726 -0.275052 -0.488838 -0.203031 0.090802 -0.173928 -0.118712 -0.123545 -0.138242 -0.105068 -0.338997 -0.127014 -0.004544 0.534816 0.009417 -0.139553 -0.208861 0.053440 -0.117261 0.053629 0.070851 0.071561 0.074926 0.078928 0.082334 0.075629 0.073870 0.072603 0.058016 0.096331 0.089576 0.096376 0.095077 0.088897 0.076528 0.085052 0.121059 0.097402 0.125619 0.163284 0.145760
qa: -0.0624 -0.0567 -0.2751 -0.4888 -0.2030 0.0908 -0.1739 -0.1187 -0.1235 -0.1382 -0.1051 -0.3390 -0.1270 -0.0045 0.5348 0.0094 -0.1396 -0.2089 0.0534 -0.1173 0.0536 0.0709 0.0716 0.0749 0.0789 0.0823 0.0756 0.0739 0.0726 0.0580 0.0963 0.0896 0.0964 0.0951 0.0889 0.0765 0.0851 0.1211 0.0974 0.1256 0.1633 0.1458
va: 1.2541 1.2631 2.1489 2.0167 2.8891 3.9397 3.9229 3.9566 3.8524 3.9153 3.8852 3.9451 3.9108 3.8191 4.0563 3.6435 4.1027 4.0583 3.9673 3.9951 3.9521 0.9990 1.0172 1.0139 0.9958 1.0041 1.0128 1.0062 1.0153 1.0208 1.0064 1.0024 1.0036 1.0073 0.9964 1.0139 1.0195 1.0015 1.0244 1.0413 1.0022 1.0069
dispcorr: -0.019881107 hartree
energy: -1748.096108557305
dipole: -73.96031 72.47819 -1.48213 30.31661 -29.37832 0.93829 -11.22835 9.36728 -1.86108
magnitude: 2.55748 au
magnitude: 6.50059 debye
