program: Orca
programVersion: 5.0.2
elementType: Cl Cl O O N C C C C C C C C C C C C C C C C H H H H H H H H H H H H H H H H H H H H H
charge: 0
multiplicity: 1
keywords: wb97x-d3
keywords: def2-TZVPP
keywords: def2/J RIJCOSX
keywords: DEFGRID2
keywords: scfconv7
keywords: smallprint printgap noloewdin
keywords: NOSOSCF
formula: C16H21Cl2NO2
InChI: InChI=1/C16H21Cl2NO2/c1-12-5-2-3-8-19(12)9-4-10-21-16(20)13-6-7-14(17)15(18)11-13/h6-7,11-12H,2-5,8-10H2,1H3
42 atoms
Cl 3.547291 0.441872 2.152746
Cl 4.547758 0.38208 -0.822744
O  -1.488977 -2.323203 -0.368561
O  -1.223782 -1.771908 1.779741
N  -2.592855 0.472575 -0.798773
C  -2.706509 1.324492 0.387954
C  -1.385764 2.067048 0.596595
C  -2.286495 1.230053 -2.001937
C  -0.985162 2.880955 -0.626973
C  -0.977489 1.992064 -1.862609
C  -3.713822 -0.430677 -1.001965
C  -3.89651 2.290151 0.385818
C  -3.818662 -1.546507 0.032732
C  -2.861454 -2.707307 -0.171147
C  -0.811854 -1.825106 0.642367
C  0.537097 -1.340511 0.247976
C  1.338354 -0.781759 1.237168
C  0.993221 -1.380429 -1.066259
C  2.575995 -0.255585 0.915619
C  2.231278 -0.854266 -1.387738
C  3.022616 -0.285046 -0.402146
H  -2.837534 0.66555 1.250235
H  -0.602066 1.335813 0.815608
H  -1.469026 2.708588 1.47717
H  -3.0915 1.931142 -2.277188
H  -2.205634 0.526008 -2.833901
H  -0.001944 3.332049 -0.474811
H  -1.684277 3.709778 -0.773602
H  -0.80803 2.582597 -2.76569
H  -0.151393 1.277243 -1.794927
H  -4.675922 0.101868 -1.041163
H  -3.597856 -0.886875 -1.989923
H  -3.923366 2.841622 1.327088
H  -3.851531 3.024356 -0.41958
H  -4.849251 1.76621 0.298208
H  -3.754447 -1.154046 1.04813
H  -4.817163 -1.985135 -0.043904
H  -3.110798 -3.236284 -1.089727
H  -2.93163 -3.420175 0.653064
H  0.996489 -0.743188 2.262385
H  0.392698 -1.805632 -1.857447
H  2.580801 -0.879245 -2.41042
elementType: Cl O N C H
totalener: -1748.07224649 hartree
nucrepener: 2071.87877355 hartree
electener: -3819.95102005 hartree
oneelecener: -6516.67535760 hartree
twoeener: 2696.72433755 hartree
cpcmener: -0.02025567 hartree
kineticenergy: 1743.01307892 hartree
xcener: -123.689901664051 hartree
chargesum: -0.0000000
charge: -0.061209 -0.056386 -0.271891 -0.482661 -0.192012 0.088715 -0.157789 -0.139103 -0.121404 -0.132772 -0.118175 -0.333936 -0.132479 0.000141 0.516784 0.004730 -0.127064 -0.251374 0.060574 -0.092500 0.047445 0.070393 0.054119 0.081223 0.083461 0.087849 0.073629 0.076932 0.078763 0.052006 0.091796 0.088695 0.095407 0.088969 0.095733 0.084660 0.094291 0.111865 0.116415 0.126809 0.151196 0.148157
qa: -0.0612 -0.0564 -0.2719 -0.4827 -0.1920 0.0887 -0.1578 -0.1391 -0.1214 -0.1328 -0.1182 -0.3339 -0.1325 0.0001 0.5168 0.0047 -0.1271 -0.2514 0.0606 -0.0925 0.0474 0.0704 0.0541 0.0812 0.0835 0.0878 0.0736 0.0769 0.0788 0.0520 0.0918 0.0887 0.0954 0.0890 0.0957 0.0847 0.0943 0.1119 0.1164 0.1268 0.1512 0.1482
va: 1.2576 1.2645 2.1297 2.0136 2.8657 3.8946 3.9360 3.9434 3.8564 3.9147 3.9167 3.9579 3.8274 3.8443 4.0908 3.5124 4.0020 4.0483 3.9557 3.9314 3.9531 1.0024 1.0264 1.0151 0.9994 1.0027 1.0131 1.0066 1.0171 1.0206 1.0012 1.0011 1.0072 0.9974 1.0028 1.0214 1.0178 0.9979 1.0067 1.0444 1.0176 1.0040
dispcorr: -0.025171368 hartree
energy: -1748.097417862505
dipole: -53.05607 51.63770 -1.41836 10.49565 -10.80432 -0.30867 -11.69323 10.01540 -1.67783
magnitude: 2.21859 au
magnitude: 5.63922 debye
