program: Orca
programVersion: 5.0.2
elementType: Cl Cl O O N C C C C C C C C C C C C C C C C H H H H H H H H H H H H H H H H H H H H H
charge: 0
multiplicity: 1
keywords: wb97x-d3
keywords: def2-TZVPP
keywords: def2/J RIJCOSX
keywords: DEFGRID2
keywords: scfconv7
keywords: smallprint printgap noloewdin
keywords: NOSOSCF
formula: C16H21Cl2NO2
InChI: InChI=1/C16H21Cl2NO2/c1-12-5-2-3-8-19(12)9-4-10-21-16(20)13-6-7-14(17)15(18)11-13/h6-7,11-12H,2-5,8-10H2,1H3
42 atoms
Cl 3.472488 0.490186 2.580503
Cl 5.62782 -0.514019 0.531426
O  -0.904235 -1.649005 0.760797
O  -0.451997 -2.740077 -1.13951
N  -3.90203 1.353327 -0.39081
C  -3.449052 1.542537 -1.775398
C  -4.3968 2.500883 -2.497617
C  -3.999735 2.610804 0.339688
C  -4.521296 3.838365 -1.781561
C  -4.933976 3.599921 -0.336905
C  -3.088122 0.415225 0.366248
C  -1.989126 1.979048 -1.925763
C  -3.065396 -0.995066 -0.206445
C  -2.307253 -1.965474 0.676973
C  -0.098029 -2.074785 -0.193206
C  1.314062 -1.663311 0.020281
C  1.692825 -0.859449 1.090329
C  2.275056 -2.104247 -0.884616
C  3.020877 -0.504163 1.25075
C  3.600721 -1.750458 -0.723037
C  3.977757 -0.948627 0.343618
H  -3.544264 0.576167 -2.277244
H  -5.386164 2.038878 -2.566743
H  -4.047016 2.639245 -3.523246
H  -3.01549 3.085075 0.485901
H  -4.374665 2.3880 1.341671
H  -5.247905 4.475375 -2.290698
H  -3.567357 4.373349 -1.810663
H  -4.933368 4.533423 0.230068
H  -5.957161 3.213643 -0.308144
H  -2.058139 0.779549 0.499446
H  -3.512787 0.358507 1.373053
H  -1.753489 2.12327 -2.981336
H  -1.766521 2.915407 -1.412685
H  -1.296638 1.226175 -1.546444
H  -4.087646 -1.374134 -0.282911
H  -2.650897 -1.019317 -1.215969
H  -2.436015 -2.992418 0.334473
H  -2.659508 -1.90998 1.706548
H  0.966424 -0.50096 1.805729
H  1.996766 -2.730104 -1.720784
H  4.345545 -2.096288 -1.426155
elementType: Cl O N C H
totalener: -1748.07801056 hartree
nucrepener: 1914.36795094 hartree
electener: -3662.44596149 hartree
oneelecener: -6200.63848394 hartree
twoeener: 2538.19252244 hartree
cpcmener: -0.02070378 hartree
kineticenergy: 1743.01009464 hartree
xcener: -123.684557379338 hartree
chargesum: -0.0000000
charge: -0.061347 -0.056306 -0.279739 -0.486050 -0.190136 0.077963 -0.163567 -0.129010 -0.126531 -0.132883 -0.132598 -0.330410 -0.097193 -0.008803 0.551618 -0.012951 -0.167209 -0.167819 0.064283 -0.121112 0.041026 0.071188 0.069261 0.075703 0.079863 0.088809 0.075456 0.073334 0.073378 0.057218 0.081338 0.093885 0.094770 0.092225 0.089343 0.080727 0.077348 0.114446 0.112345 0.134561 0.146445 0.147134
qa: -0.0613 -0.0563 -0.2797 -0.4861 -0.1901 0.0780 -0.1636 -0.1290 -0.1265 -0.1329 -0.1326 -0.3304 -0.0972 -0.0088 0.5516 -0.0130 -0.1672 -0.1678 0.0643 -0.1211 0.0410 0.0712 0.0693 0.0757 0.0799 0.0888 0.0755 0.0733 0.0734 0.0572 0.0813 0.0939 0.0948 0.0922 0.0893 0.0807 0.0773 0.1144 0.1123 0.1346 0.1464 0.1471
va: 1.2561 1.2640 2.1375 2.0143 2.9531 3.9418 3.9009 3.9539 3.8614 3.9073 3.9303 3.9373 3.7880 3.8732 4.0438 3.6394 4.0936 4.0533 3.9492 3.9926 3.9661 1.0028 1.0216 1.0134 0.9993 1.0024 1.0124 1.0078 1.0155 1.0209 1.0027 1.0027 1.0084 0.9976 1.0015 1.0274 1.0317 1.0127 0.9994 1.0365 1.0208 1.0059
dispcorr: -0.019786739 hartree
energy: -1748.097797296974
dipole: -63.79474 63.32217 -0.47257 20.00538 -19.75541 0.24997 -19.22924 19.42984 0.20059
magnitude: 0.57101 au
magnitude: 1.45138 debye
