program: Orca
programVersion: 5.0.2
elementType: Cl Cl O O N C C C C C C C C C C C C C C C C H H H H H H H H H H H H H H H H H H H H H
charge: 0
multiplicity: 1
keywords: wb97x-d3
keywords: def2-TZVPP
keywords: def2/J RIJCOSX
keywords: DEFGRID2
keywords: scfconv7
keywords: smallprint printgap noloewdin
keywords: NOSOSCF
formula: C16H21Cl2NO2
InChI: InChI=1/C16H21Cl2NO2/c1-12-5-2-3-8-19(12)9-4-10-21-16(20)13-6-7-14(17)15(18)11-13/h6-7,11-12H,2-5,8-10H2,1H3
42 atoms
Cl 4.206577 -1.271533 -1.80641
Cl 5.709887 -0.652717 0.877406
O  -0.71321 -1.79046 -0.263931
O  -0.828926 -1.568025 1.963775
N  -3.917485 1.327579 -0.169275
C  -3.710959 1.965675 -1.47404
C  -4.847291 2.953926 -1.739941
C  -3.985952 2.296032 0.915309
C  -4.981405 3.994204 -0.636355
C  -5.108483 3.29947 0.711441
C  -2.942133 0.296823 0.149405
C  -2.340561 2.620564 -1.668592
C  -2.86731 -0.815098 -0.88851
C  -2.122079 -2.047556 -0.420642
C  -0.198297 -1.577418 0.931641
C  1.270061 -1.351059 0.880923
C  1.978112 -1.40439 -0.315108
C  1.944069 -1.082739 2.06825
C  3.345673 -1.19283 -0.318536
C  3.309034 -0.867467 2.063743
C  4.014357 -0.921329 0.870992
H  -3.798975 1.180983 -2.229845
H  -5.786453 2.399408 -1.825642
H  -4.681997 3.434608 -2.707111
H  -3.035239 2.836526 1.052812
H  -4.154683 1.748215 1.845829
H  -5.848636 4.631757 -0.822515
H  -4.109567 4.655373 -0.630382
H  -5.091167 4.025265 1.527304
H  -6.071278 2.783535 0.769409
H  -1.937907 0.719162 0.31331
H  -3.243088 -0.141881 1.105012
H  -1.525861 1.902052 -1.564531
H  -2.271064 3.037473 -2.674561
H  -2.151286 3.433167 -0.966284
H  -3.878181 -1.149627 -1.13654
H  -2.417718 -0.463522 -1.82025
H  -2.178895 -2.825658 -1.180114
H  -2.543056 -2.446106 0.502482
H  1.480541 -1.612015 -1.251639
H  1.409866 -1.042482 3.007051
H  3.828926 -0.659565 2.988561
elementType: Cl O N C H
totalener: -1748.07731094 hartree
nucrepener: 1905.54855023 hartree
electener: -3653.62586117 hartree
oneelecener: -6183.14915633 hartree
twoeener: 2529.52329516 hartree
cpcmener: -0.02058066 hartree
kineticenergy: 1743.01391127 hartree
xcener: -123.685542363235 hartree
chargesum: -0.0000000
charge: -0.061793 -0.056392 -0.278793 -0.483075 -0.181949 0.087196 -0.164723 -0.128641 -0.129254 -0.130992 -0.154499 -0.334313 -0.063615 -0.014319 0.546603 -0.010288 -0.167033 -0.173122 0.066558 -0.118187 0.038797 0.067953 0.069437 0.074843 0.080805 0.088625 0.074891 0.073860 0.073051 0.057709 0.080596 0.092861 0.091081 0.095481 0.092038 0.074469 0.073262 0.117629 0.105100 0.134636 0.145825 0.147684
qa: -0.0618 -0.0564 -0.2788 -0.4831 -0.1819 0.0872 -0.1647 -0.1286 -0.1293 -0.1310 -0.1545 -0.3343 -0.0636 -0.0143 0.5466 -0.0103 -0.1670 -0.1731 0.0666 -0.1182 0.0388 0.0680 0.0694 0.0748 0.0808 0.0886 0.0749 0.0739 0.0731 0.0577 0.0806 0.0929 0.0911 0.0955 0.0920 0.0745 0.0733 0.1176 0.1051 0.1346 0.1458 0.1477
va: 1.2558 1.2638 2.1395 2.0192 2.9629 3.9328 3.9054 3.9520 3.8634 3.9026 3.9744 3.9382 3.7827 3.8788 4.0517 3.6391 4.0951 4.0592 3.9452 3.9895 3.9682 1.0034 1.0215 1.0137 1.0005 1.0030 1.0127 1.0072 1.0159 1.0207 0.9915 1.0068 1.0025 1.0084 0.9972 1.0267 1.0170 1.0000 1.0163 1.0382 1.0208 1.0055
dispcorr: -0.019747440 hartree
energy: -1748.097058378849
dipole: -68.10677 67.67227 -0.43449 27.48781 -27.34980 0.13801 -4.05970 3.51833 -0.54136
magnitude: 0.70775 au
magnitude: 1.79895 debye
