program: Orca
programVersion: 5.0.2
elementType: Cl Cl O O N C C C C C C C C C C C C C C C C H H H H H H H H H H H H H H H H H H H H H
charge: 0
multiplicity: 1
keywords: wb97x-d3
keywords: def2-TZVPP
keywords: def2/J RIJCOSX
keywords: DEFGRID2
keywords: scfconv7
keywords: smallprint printgap noloewdin
keywords: NOSOSCF
formula: C16H21Cl2NO2
InChI: InChI=1/C16H21Cl2NO2/c1-12-5-2-3-8-19(12)9-4-10-21-16(20)13-6-7-14(17)15(18)11-13/h6-7,11-12H,2-5,8-10H2,1H3
42 atoms
Cl 3.120281 -0.402105 -2.005907
Cl 4.623556 0.616528 0.556412
O  -1.347386 -2.207349 -0.060209
O  -1.409822 -1.79749 2.135621
N  -2.513043 0.533014 -0.682716
C  -2.742472 1.340842 0.516817
C  -1.46579 2.11475 0.851159
C  -2.129526 1.331761 -1.834855
C  -0.990373 2.971281 -0.315069
C  -0.853304 2.114261 -1.565275
C  -3.577744 -0.402535 -0.999621
C  -3.961608 2.267163 0.454474
C  -3.744608 -1.537641 0.005526
C  -2.715363 -2.649009 -0.091515
C  -0.835809 -1.770707 1.069599
C  0.540379 -1.229994 0.910279
C  1.145072 -1.119457 -0.336976
C  1.211856 -0.77664 2.041572
C  2.40221 -0.552508 -0.449567
C  2.470226 -0.216887 1.930005
C  3.067582 -0.097839 0.6842
H  -2.915707 0.64988 1.345806
H  -0.680858 1.400394 1.117001
H  -1.640187 2.729758 1.737384
H  -2.924073 2.02599 -2.155359
H  -1.966014 0.65445 -2.676833
H  -0.038569 3.447793 -0.069905
H  -1.701275 3.78195 -0.501453
H  -0.618133 2.730259 -2.436231
H  -0.021356 1.413269 -1.441015
H  -4.55091 0.096361 -1.124447
H  -3.352375 -0.840563 -1.976746
H  -4.074354 2.79441 1.403184
H  -3.887329 3.021314 -0.330093
H  -4.886183 1.712426 0.288714
H  -3.823987 -1.159543 1.025419
H  -4.703138 -2.023923 -0.196095
H  -2.800355 -3.148835 -1.055396
H  -2.879593 -3.39773 0.68611
H  0.643108 -1.456262 -1.23295
H  0.756701 -0.851859 3.019039
H  2.987644 0.13642 2.811066
elementType: Cl O N C H
totalener: -1748.07271781 hartree
nucrepener: 2076.17455366 hartree
electener: -3824.24727147 hartree
oneelecener: -6525.17895370 hartree
twoeener: 2700.93168223 hartree
cpcmener: -0.01984988 hartree
kineticenergy: 1743.00990207 hartree
xcener: -123.688810030212 hartree
chargesum: 0.0000000
charge: -0.064550 -0.056713 -0.266496 -0.483059 -0.192881 0.091144 -0.160454 -0.134674 -0.116364 -0.132736 -0.118710 -0.331944 -0.130372 -0.000652 0.514732 0.002122 -0.223995 -0.148233 0.086476 -0.121066 0.050106 0.067836 0.052444 0.081207 0.081610 0.086859 0.073907 0.075851 0.079840 0.047634 0.090605 0.088570 0.095527 0.088647 0.095193 0.084532 0.095076 0.110775 0.116528 0.135010 0.142700 0.147968
qa: -0.0645 -0.0567 -0.2665 -0.4831 -0.1929 0.0911 -0.1605 -0.1347 -0.1164 -0.1327 -0.1187 -0.3319 -0.1304 -0.0007 0.5147 0.0021 -0.2240 -0.1482 0.0865 -0.1211 0.0501 0.0678 0.0524 0.0812 0.0816 0.0869 0.0739 0.0759 0.0798 0.0476 0.0906 0.0886 0.0955 0.0886 0.0952 0.0845 0.0951 0.1108 0.1165 0.1350 0.1427 0.1480
va: 1.2518 1.2639 2.1337 2.0131 2.8669 3.8889 3.9415 3.9460 3.8511 3.9206 3.9208 3.9581 3.8261 3.8450 4.0873 3.5175 4.0618 4.0055 3.9012 3.9927 3.9604 1.0041 1.0269 1.0144 0.9994 1.0032 1.0134 1.0072 1.0162 1.0170 1.0003 1.0002 1.0072 0.9978 1.0025 1.0201 1.0180 0.9984 1.0069 1.0376 1.0230 1.0047
dispcorr: -0.025115810 hartree
energy: -1748.097833614886
dipole: -51.14738 50.02393 -1.12345 13.23222 -13.26554 -0.03332 0.06271 -0.53689 -0.47418
magnitude: 1.21988 au
magnitude: 3.10068 debye
