program: Gaussian 09
title: 000068442
version: EM64L-G09RevD.01
frameworkgroup: C1[X(C5H4N2O4)]
method: RPBEPBE
basis: SDD
operation: Freq
keyword: #pfreq=noraman
keyword: PBEPBE/SDD
title: #p freq=noraman PBEPBE/SDD
converged: NO NO NO NO
title: Mulliken charges:
elementType: O O O O N N C C C C C H H H H
charge: -0.481198 -0.393237 -0.170898 -0.209819 -0.373137 -0.041056 0.200695 0.011810 -0.202246 0.122197 0.123644 0.362464 0.273571 0.394901 0.382307
chargesum: 0.00000
title: Mulliken charges with hydrogens summed into heavy atoms:
elementType: O O O O N N C C C C C
charge: -0.086297 -0.010930 -0.170898 -0.209819 -0.010673 -0.041056 0.200695 0.011810 0.071325 0.122197 0.123644
polarizability: 1.06163348e+02 2.72459138e+00 1.02392149e+02 -5.08033119e-03 -4.08844325e-03 3.32909463e+01
1716.lowfreq: -34.3163 -4.8379 0.0003 0.0004 0.0007 3.2716 9.5080 54.1225 149.1700
frequency: -34.3154 54.1087 149.1684 173.0616 218.4645 223.1160 352.2421 374.2450 485.7533 535.0396 552.0530 572.4834 625.7401 643.4726 657.6969 672.4426 710.8496 768.4185 780.2993 830.4232 915.3264 931.3967 1014.9895 1083.1781 1142.7458 1183.8112 1208.3028 1273.0222 1316.3883 1341.5169 1376.9520 1441.0094 1533.8897 1646.2034 1693.8813 3245.7751 3511.7746 3547.8531 3562.2068
redmass: 13.7513 9.4917 9.4937 6.9205 5.1271 7.5147 8.0716 8.7041 10.2341 1.4722 5.5539 1.4118 2.5549 5.6602 2.6850 4.4697 8.5752 1.5270 3.0751 1.4966 8.3039 6.5719 4.0828 1.5693 2.5956 1.6174 2.3471 2.8676 4.1618 3.9369 3.3868 3.2167 7.9654 9.0461 9.6291 1.0996 1.0640 1.0649 1.0826
irintensity: 0.3335 1.7157 1.7539 5.6392 12.6968 4.1936 1.0147 12.9062 4.6952 40.6423 46.9877 145.0448 22.0419 50.8534 118.9444 13.7125 44.9147 78.2518 42.5266 4.9718 45.3142 427.3086 56.2972 180.7695 63.7061 50.1245 21.8326 25.5011 3.5237 174.2712 22.2649 62.1220 4.2369 92.2784 356.5062 1.3826 43.1219 53.7072 101.3051
temp: 298.150 k
press: 1.00000 atm
elementType: 8 8 8 8 7 7 6 6 6 6 6 1 1 1 1
symmnumber: 1
zpe: 253305.1 jmol-1
zpe.correction: 0.096479 hartree
zpe.thermalcorrener: 0.105098 hartree
zpe.thermalcorrenthalpy: 0.106042 hartree
zpe.thermalcorrgfe: 0.062096 hartree
zpe.sumelectzpe: -602.539249 hartree
zpe.sumelectthermal: -602.530629 hartree
zpe.sumelectthermalent: -602.529685 hartree
zpe.sumelectthermalfe: -602.573632 hartree
dipole: -3.8084 3.3194 0.0045
dipole: 5.0520
quadrupole: -47.8214 -64.3424 -62.0914
quadrupole: -8.4300 0.0233 0.0234
quadrupole: 10.2636 -6.2573 -4.0063 -8.4300 0.0233 0.0234
hfenergy: -602.6357273 hartree
pointgroup: C01 [X(C5H4N2O4)]
dipole: -1.372249 -1.4378753 -0.0019839 debye
dipolederiv: -1.3250165 -0.2423733 -0.000648 -0.3799101 -0.4076169 -0.0000621 0.0019487 0.0010857 -0.4665238 -1.3496658 0.1162807 -0.0017077 0.1167078 -0.2131062 -0.0002231 0.0016901 -0.0014425 -0.4090992 -0.5965293 0.1696054 0.000211 0.0940707 -0.9739183 0.0013264 0.0000473 -0.002696 -0.2902575 -0.6379312 -0.0889702 0.0004243 0.0276988 -0.895954 -0.0008458 -0.0017284 0.0033122 -0.3084272 -0.4707703 -0.2304048 -0.0003345 -0.459703 -0.2423728 -0.0002309 -0.0003481 -0.0002093 -0.1955473 -0.2545866 -0.111875 -0.0000871 0.2741899 -0.4994298 -0.0000682 -0.0005791 -0.0012289 -0.2392012 -0.3312825 0.555929 0.0000144 0.7142593 -0.2016911 0.0002962 -0.0020329 0.0010389 0.0249286 -0.0128753 -0.326224 0.0000402 -0.4153974 0.0193673 0.0004494 -0.0009955 -0.0006167 0.0392129 0.1080958 0.1652236 0.0007952 -0.0107829 0.2088761 0.0000098 0.0001044 0.0006795 -0.0373401 1.9279983 -0.1527011 -0.0000786 -0.212935 1.4305828 -0.0009418 -0.0008949 0.000761 0.2918844 1.8419346 0.1068222 0.0010061 0.2379799 1.23621 -0.000309 0.0017043 -0.0013583 0.2454543 0.2749744 0.026834 -0.0001999 0.0074276 0.2831889 0.0001736 -0.0001086 0.0001397 0.349366 0.0995331 -0.0283098 -0.0000457 -0.0306356 0.0114328 -0.0000724 -0.0000235 -0.0001081 0.1890924 0.3481522 0.0477481 0.0003176 0.1125689 0.1499952 -0.000296 0.0005734 -0.000456 0.4109105 0.3779691 -0.0075847 0.0002929 -0.0755389 0.0944359 0.000794 0.0006428 0.0010987 0.3955471 unknown
polarizability: 106.6292497|-2.3343596|101.9262307|0.031446|-0.0170623|33.290963 unknown
InChI: InChI=1S/C5H4N2O4/c8-4(9)2-3(5(10)11)7-1-6-2/h1,6,8,10H
charge 0 multiplicity 1
15 atoms
O  -2.98766 0.050855 -0.000021
O  3.007034 0.527754 0.001626
O  -1.655993 1.973278 0.001545
O  1.305539 2.110165 -0.003482
N  -1.002638 -1.635025 -0.001494
N  1.251135 -1.578709 0.002249
C  -0.660876 -0.278006 -0.001148
C  0.759428 -0.266773 0.002157
C  0.161996 -2.374919 0.000354
C  -1.730995 0.732285 -0.003103
C  1.660291 0.909365 0.00436
H  -1.97202 -1.959155 -0.003406
H  0.18346 -3.461873 0.000085
H  -3.71706 0.725285 0.002733
H  3.557558 1.358173 -0.002353
