program: Orca
programVersion: 5.0.2
elementType: Cl Cl O O N C C C C C C C C C C C C C C C C H H H H H H H H H H H H H H H H H H H H H
charge: 0
multiplicity: 1
keywords: wb97x-d3
keywords: def2-TZVPP
keywords: def2/J RIJCOSX
keywords: DEFGRID2
keywords: scfconv7
keywords: smallprint printgap noloewdin
keywords: NOSOSCF
formula: C16H21Cl2NO2
InChI: InChI=1/C16H21Cl2NO2/c1-12-5-2-3-8-19(12)9-4-10-21-16(20)13-6-7-14(17)15(18)11-13/h6-7,11-12H,2-5,8-10H2,1H3
42 atoms
Cl 3.521183 0.792389 -0.721693
Cl 5.584638 -0.671814 1.136409
O  -0.883842 -1.745074 0.236874
O  -0.530022 -3.355709 1.741919
N  -3.363079 1.385445 -1.179759
C  -2.754438 2.709283 -1.02019
C  -3.278992 3.644773 -2.108384
C  -4.816013 1.425977 -1.113052
C  -4.799964 3.731581 -2.106149
C  -5.400627 2.334638 -2.182913
C  -2.801819 0.404814 -0.267864
C  -2.903579 3.327533 0.372318
C  -2.905129 -1.024601 -0.79029
C  -2.290658 -2.036909 0.148576
C  -0.127123 -2.445831 1.053504
C  1.28694 -1.987611 1.047832
C  1.704884 -0.930094 0.24649
C  2.205194 -2.630684 1.871887
C  3.026483 -0.521149 0.273713
C  3.525749 -2.223076 1.897175
C  3.941459 -1.168255 1.098506
H  -1.681656 2.57467 -1.193185
H  -2.941963 3.28031 -3.083244
H  -2.835534 4.634639 -1.97531
H  -5.175972 1.747206 -0.121618
H  -5.201798 0.414755 -1.256684
H  -5.143307 4.342799 -2.943657
H  -5.14796 4.232401 -1.197857
H  -6.486245 2.371545 -2.067735
H  -5.203222 1.904085 -3.169292
H  -1.747214 0.652007 -0.126036
H  -3.263092 0.450553 0.731858
H  -2.356212 4.270561 0.419301
H  -3.939769 3.540134 0.637588
H  -2.491403 2.680572 1.148256
H  -3.950367 -1.315382 -0.91929
H  -2.436165 -1.102955 -1.77406
H  -2.425489 -3.05191 -0.229328
H  -2.739331 -1.97792 1.143021
H  1.013959 -0.412833 -0.404032
H  1.899505 -3.454611 2.501389
H  4.235985 -2.725855 2.538537
elementType: Cl O N C H
totalener: -1748.07912805 hartree
nucrepener: 1895.23160014 hartree
electener: -3643.31072819 hartree
oneelecener: -6162.28881022 hartree
twoeener: 2518.97808203 hartree
cpcmener: -0.02129375 hartree
kineticenergy: 1743.01509684 hartree
xcener: -123.683790455827 hartree
chargesum: 0.0000000
charge: -0.060308 -0.055994 -0.271135 -0.487532 -0.204753 0.101246 -0.159499 -0.127174 -0.129656 -0.140351 -0.106793 -0.331762 -0.087081 -0.029042 0.541153 0.001397 -0.166181 -0.167518 0.062046 -0.120453 0.037974 0.058764 0.067587 0.074658 0.081407 0.094817 0.075325 0.073995 0.073454 0.059632 0.094167 0.074672 0.095471 0.088033 0.093820 0.075319 0.059907 0.122097 0.107620 0.136927 0.145483 0.148260
qa: -0.0603 -0.0560 -0.2711 -0.4875 -0.2048 0.1012 -0.1595 -0.1272 -0.1297 -0.1404 -0.1068 -0.3318 -0.0871 -0.0290 0.5412 0.0014 -0.1662 -0.1675 0.0620 -0.1205 0.0380 0.0588 0.0676 0.0747 0.0814 0.0948 0.0753 0.0740 0.0735 0.0596 0.0942 0.0747 0.0955 0.0880 0.0938 0.0753 0.0599 0.1221 0.1076 0.1369 0.1455 0.1483
va: 1.2583 1.2642 2.1535 2.0200 2.9307 3.9483 3.8996 3.9391 3.8621 3.9195 3.9254 3.9330 3.8904 3.8776 4.0511 3.6522 4.0842 4.0552 3.9596 3.9888 3.9673 1.0060 1.0223 1.0132 1.0023 0.9991 1.0126 1.0069 1.0155 1.0198 1.0003 0.9998 1.0082 0.9976 1.0022 1.0212 1.0344 1.0006 0.9986 1.0287 1.0206 1.0051
dispcorr: -0.019066158 hartree
energy: -1748.098194207458
dipole: -66.57755 65.63546 -0.94209 21.57196 -21.17211 0.39985 -11.14523 11.16062 0.01540
magnitude: 1.02355 au
magnitude: 2.60165 debye
