program: Orca
programVersion: 5.0.2
elementType: Cl Cl O O N C C C C C C C C C C C C C C C C H H H H H H H H H H H H H H H H H H H H H
charge: 0
multiplicity: 1
keywords: wb97x-d3
keywords: def2-TZVPP
keywords: def2/J RIJCOSX
keywords: DEFGRID2
keywords: scfconv7
keywords: smallprint printgap noloewdin
keywords: NOSOSCF
formula: C16H21Cl2NO2
InChI: InChI=1/C16H21Cl2NO2/c1-12-5-2-3-8-19(12)9-4-10-21-16(20)13-6-7-14(17)15(18)11-13/h6-7,11-12H,2-5,8-10H2,1H3
42 atoms
Cl 2.407142 2.095544 1.181181
Cl 4.850735 0.351214 0.260088
O  -1.460848 -1.341145 1.332991
O  -0.733417 -3.3251 0.595182
N  -3.079306 0.767836 -0.367828
C  -3.72668 2.084499 -0.314778
C  -2.662469 3.179002 -0.236206
C  -2.158121 0.639893 -1.487409
C  -1.687139 3.106259 -1.403765
C  -1.079718 1.7128 -1.470089
C  -4.054256 -0.307858 -0.339063
C  -4.726726 2.365486 -1.44217
C  -3.512181 -1.687131 0.01813
C  -2.827751 -1.789503 1.368477
C  -0.534807 -2.168203 0.888412
C  0.798791 -1.523298 0.775839
C  0.974513 -0.169542 1.041791
C  1.883838 -2.290963 0.363086
C  2.219304 0.411661 0.879182
C  3.129386 -1.711488 0.211567
C  3.301097 -0.358297 0.464738
H  -4.292534 2.108703 0.622934
H  -2.107902 3.071646 0.700733
H  -3.153471 4.154041 -0.198926
H  -2.682748 0.674755 -2.456727
H  -1.682421 -0.341638 -1.442864
H  -0.905698 3.861793 -1.292558
H  -2.201897 3.333228 -2.342351
H  -0.452307 1.599624 -2.357189
H  -0.428308 1.564161 -0.604252
H  -4.812729 -0.045242 0.404542
H  -4.590193 -0.408067 -1.296308
H  -5.55262 1.653492 -1.442014
H  -5.161621 3.357355 -1.308779
H  -4.271894 2.340333 -2.43311
H  -4.372496 -2.360466 0.046298
H  -2.866277 -2.083214 -0.768607
H  -2.866091 -2.809718 1.75024
H  -3.310817 -1.144621 2.101544
H  0.148079 0.445864 1.367238
H  1.766606 -3.345272 0.15304
H  3.970066 -2.309567 -0.111447
elementType: Cl O N C H
totalener: -1748.07576878 hartree
nucrepener: 2021.55624329 hartree
electener: -3769.63201207 hartree
oneelecener: -6415.53051816 hartree
twoeener: 2645.89850609 hartree
cpcmener: -0.02109953 hartree
kineticenergy: 1743.00478398 hartree
xcener: -123.684427652968 hartree
chargesum: -0.0000000
charge: -0.062691 -0.056244 -0.269533 -0.484968 -0.197429 0.095768 -0.159929 -0.156913 -0.131817 -0.102213 -0.096491 -0.337591 -0.141053 -0.007895 0.529562 0.023879 -0.208339 -0.173402 0.076597 -0.118027 0.040240 0.059143 0.067118 0.077434 0.091642 0.093197 0.073742 0.077399 0.079915 0.029540 0.092503 0.081606 0.094788 0.095792 0.088539 0.094223 0.085703 0.112714 0.113880 0.136543 0.144566 0.148505
qa: -0.0627 -0.0562 -0.2695 -0.4850 -0.1974 0.0958 -0.1599 -0.1569 -0.1318 -0.1022 -0.0965 -0.3376 -0.1411 -0.0079 0.5296 0.0239 -0.2083 -0.1734 0.0766 -0.1180 0.0402 0.0591 0.0671 0.0774 0.0916 0.0932 0.0737 0.0774 0.0799 0.0295 0.0925 0.0816 0.0948 0.0958 0.0885 0.0942 0.0857 0.1127 0.1139 0.1365 0.1446 0.1485
va: 1.2566 1.2643 2.1425 2.0173 2.8691 3.9477 3.9003 3.9418 3.8746 3.9206 3.9489 3.9337 3.8301 3.8346 4.0841 3.5749 4.0390 4.0682 3.9383 3.9863 3.9728 1.0056 1.0216 1.0129 1.0058 0.9988 1.0139 1.0076 1.0153 1.0295 0.9940 1.0056 1.0013 1.0084 0.9980 1.0149 1.0165 1.0157 1.0011 1.0394 1.0206 1.0045
dispcorr: -0.022912863 hartree
energy: -1748.098681642234
dipole: -54.09720 52.91912 -1.17808 6.34623 -6.13976 0.20647 -15.11645 14.83622 -0.28023
magnitude: 1.22843 au
magnitude: 3.12241 debye
