program: Orca
programVersion: 5.0.2
elementType: Cl Cl O O N C C C C C C C C C C C C C C C C H H H H H H H H H H H H H H H H H H H H H
charge: 0
multiplicity: 1
keywords: wb97x-d3
keywords: def2-TZVPP
keywords: def2/J RIJCOSX
keywords: DEFGRID2
keywords: scfconv7
keywords: smallprint printgap noloewdin
keywords: NOSOSCF
formula: C16H21Cl2NO2
InChI: InChI=1/C16H21Cl2NO2/c1-12-5-2-3-8-19(12)9-4-10-21-16(20)13-6-7-14(17)15(18)11-13/h6-7,11-12H,2-5,8-10H2,1H3
42 atoms
Cl 3.746782 -0.227213 -1.708928
Cl 4.396353 0.825252 1.175033
O  -1.596359 -2.005459 1.055111
O  -1.043924 -2.326375 -1.09497
N  -2.54206 0.412673 -0.439815
C  -2.623305 1.409678 0.632599
C  -1.323619 2.214258 0.686108
C  -2.249985 0.995124 -1.740318
C  -0.990806 2.866256 -0.647608
C  -0.960407 1.799874 -1.731488
C  -3.701818 -0.461912 -0.525705
C  -3.847198 2.328733 0.565733
C  -3.928312 -1.347568 0.693413
C  -2.93996 -2.482094 0.869564
C  -0.795502 -1.9048 0.012228
C  0.496331 -1.252856 0.35161
C  1.419393 -1.077083 -0.672539
C  0.796237 -0.800275 1.632881
C  2.622188 -0.442254 -0.424338
C  1.999701 -0.165369 1.881419
C  2.913418 0.020409 0.855311
H  -2.687282 0.862013 1.577074
H  -0.505537 1.544675 0.966996
H  -1.401474 2.961601 1.479256
H  -3.07259 1.633387 -2.105888
H  -2.161869 0.179293 -2.462696
H  -0.030081 3.382402 -0.586825
H  -1.736115 3.627817 -0.896322
H  -0.811079 2.244929 -2.71787
H  -0.115814 1.126652 -1.555302
H  -4.627056 0.101631 -0.72043
H  -3.569364 -1.106036 -1.399386
H  -3.812013 3.05158 1.382397
H  -3.905713 2.892451 -0.366252
H  -4.780719 1.774935 0.672935
H  -3.990537 -0.756996 1.610099
H  -4.907369 -1.820924 0.582206
H  -2.983922 -3.17511 0.029144
H  -3.169003 -3.042622 1.775009
H  1.201002 -1.42422 -1.673083
H  0.099182 -0.922884 2.449018
H  2.228224 0.191334 2.876093
elementType: Cl O N C H
totalener: -1748.07229562 hartree
nucrepener: 2087.62349479 hartree
electener: -3835.69579041 hartree
oneelecener: -6548.17045043 hartree
twoeener: 2712.47466002 hartree
cpcmener: -0.01991995 hartree
kineticenergy: 1743.02678634 hartree
xcener: -123.695659739028 hartree
chargesum: -0.0000000
charge: -0.063024 -0.057233 -0.279606 -0.487390 -0.178714 0.059823 -0.146307 -0.131542 -0.120386 -0.138982 -0.130553 -0.333085 -0.116111 0.004905 0.524442 0.002985 -0.160520 -0.227809 0.077015 -0.087645 0.038787 0.071226 0.055471 0.081447 0.087887 0.088252 0.073098 0.075209 0.079466 0.055749 0.094595 0.095066 0.095010 0.091408 0.093386 0.081347 0.089452 0.100806 0.114786 0.128206 0.150567 0.148516
qa: -0.0630 -0.0572 -0.2796 -0.4874 -0.1787 0.0598 -0.1463 -0.1315 -0.1204 -0.1390 -0.1306 -0.3331 -0.1161 0.0049 0.5244 0.0030 -0.1605 -0.2278 0.0770 -0.0876 0.0388 0.0712 0.0555 0.0814 0.0879 0.0883 0.0731 0.0752 0.0795 0.0557 0.0946 0.0951 0.0950 0.0914 0.0934 0.0813 0.0895 0.1008 0.1148 0.1282 0.1506 0.1485
va: 1.2548 1.2633 2.1289 2.0082 2.8493 3.9418 3.9194 3.9117 3.8659 3.9295 3.8735 3.9536 3.8580 3.8488 4.1130 3.4993 4.0271 4.0418 3.9378 3.9363 3.9582 1.0004 1.0315 1.0151 1.0037 1.0067 1.0130 1.0076 1.0177 1.0184 1.0024 1.0071 1.0083 0.9985 1.0015 1.0109 1.0173 1.0190 1.0006 1.0441 1.0187 1.0039
dispcorr: -0.025877106 hartree
energy: -1748.098172723406
dipole: -53.38174 51.70913 -1.67262 12.07489 -11.69126 0.38363 1.34126 0.19770 1.53896
magnitude: 2.30504 au
magnitude: 5.85895 debye
