program: Orca
programVersion: 5.0.2
elementType: Cl Cl O O N C C C C C C C C C C C C C C C C H H H H H H H H H H H H H H H H H H H H H
charge: 0
multiplicity: 1
keywords: wb97x-d3
keywords: def2-TZVPP
keywords: def2/J RIJCOSX
keywords: DEFGRID2
keywords: scfconv7
keywords: smallprint printgap noloewdin
keywords: NOSOSCF
formula: C16H21Cl2NO2
InChI: InChI=1/C16H21Cl2NO2/c1-12-5-2-3-8-19(12)9-4-10-21-16(20)13-6-7-14(17)15(18)11-13/h6-7,11-12H,2-5,8-10H2,1H3
42 atoms
Cl 5.498724 -0.833385 1.776231
Cl 5.766742 -2.640437 -0.775264
O  -0.544046 -0.80079 0.094618
O  0.308594 0.117119 1.941511
N  -4.185776 1.415048 -0.568741
C  -5.318606 1.96989 0.17569
C  -5.190347 3.492027 0.238887
C  -4.088083 1.946239 -1.919721
C  -5.074204 4.115984 -1.146127
C  -3.937343 3.458633 -1.915241
C  -4.161135 -0.0378 -0.55519
C  -6.696594 1.541347 -0.336077
C  -2.767143 -0.625818 -0.752185
C  -1.847863 -0.26967 0.393609
C  0.441466 -0.524932 0.924507
C  1.743663 -1.080011 0.475599
C  2.872256 -0.765695 1.223642
C  1.866721 -1.882608 -0.65485
C  4.112719 -1.242146 0.84299
C  3.10693 -2.364339 -1.031151
C  4.232439 -2.044378 -0.287654
H  -5.227549 1.591549 1.199126
H  -4.302027 3.749416 0.823002
H  -6.047542 3.902306 0.777788
H  -4.956936 1.665839 -2.537791
H  -3.218752 1.503103 -2.40897
H  -4.909947 5.192392 -1.062416
H  -6.010488 3.989569 -1.697202
H  -3.903893 3.818706 -2.94574
H  -2.98052 3.724271 -1.456375
H  -4.546662 -0.379025 0.410089
H  -4.826907 -0.470242 -1.316924
H  -7.476317 1.957607 0.303645
H  -6.896938 1.877098 -1.353776
H  -6.812994 0.456935 -0.318618
H  -2.865668 -1.711768 -0.823286
H  -2.335209 -0.286821 -1.696933
H  -2.210332 -0.700747 1.330089
H  -1.775621 0.809953 0.519367
H  2.789706 -0.141654 2.102795
H  1.006204 -2.145379 -1.252716
H  3.20139 -2.989611 -1.907815
elementType: Cl O N C H
totalener: -1748.07741370 hartree
nucrepener: 1848.65335465 hartree
electener: -3596.73076835 hartree
oneelecener: -6069.39386203 hartree
twoeener: 2472.66309368 hartree
cpcmener: -0.02071431 hartree
kineticenergy: 1743.02846204 hartree
xcener: -123.687049156838 hartree
chargesum: -0.0000000
charge: -0.061968 -0.056200 -0.276171 -0.489328 -0.212979 0.110360 -0.167934 -0.127695 -0.125814 -0.143834 -0.115275 -0.335081 -0.117377 0.025259 0.547624 -0.005939 -0.124505 -0.207724 0.043557 -0.113522 0.053193 0.057150 0.070101 0.075346 0.080819 0.095535 0.075479 0.073210 0.072684 0.060811 0.096747 0.089733 0.095880 0.087840 0.094266 0.086702 0.072231 0.104665 0.083308 0.126319 0.155754 0.146771
qa: -0.0620 -0.0562 -0.2762 -0.4893 -0.2130 0.1104 -0.1679 -0.1277 -0.1258 -0.1438 -0.1153 -0.3351 -0.1174 0.0253 0.5476 -0.0059 -0.1245 -0.2077 0.0436 -0.1135 0.0532 0.0571 0.0701 0.0753 0.0808 0.0955 0.0755 0.0732 0.0727 0.0608 0.0967 0.0897 0.0959 0.0878 0.0943 0.0867 0.0722 0.1047 0.0833 0.1263 0.1558 0.1468
va: 1.2548 1.2639 2.1602 2.0160 2.8789 3.9305 3.9179 3.9425 3.8550 3.9302 3.9366 3.9395 3.9001 3.7994 4.0371 3.6617 4.0785 4.0677 3.9766 3.9756 3.9537 1.0056 1.0196 1.0131 1.0028 1.0004 1.0129 1.0072 1.0156 1.0179 0.9935 1.0031 1.0085 0.9975 1.0020 1.0187 1.0176 0.9989 1.0380 1.0422 1.0105 1.0057
dispcorr: -0.018751886 hartree
energy: -1748.096165586215
dipole: -85.55244 83.62221 -1.93023 29.55362 -30.12673 -0.57312 -13.53512 11.98289 -1.55223
magnitude: 2.54238 au
magnitude: 6.46221 debye
