program: Orca
programVersion: 5.0.2
elementType: Cl Cl O O N C C C C C C C C C C C C C C C C H H H H H H H H H H H H H H H H H H H H H
charge: 0
multiplicity: 1
keywords: wb97x-d3
keywords: def2-TZVPP
keywords: def2/J RIJCOSX
keywords: DEFGRID2
keywords: scfconv7
keywords: smallprint printgap noloewdin
keywords: NOSOSCF
formula: C16H21Cl2NO2
InChI: InChI=1/C16H21Cl2NO2/c1-12-5-2-3-8-19(12)9-4-10-21-16(20)13-6-7-14(17)15(18)11-13/h6-7,11-12H,2-5,8-10H2,1H3
42 atoms
Cl 4.725785 -1.143104 2.095425
Cl 5.51646 -0.545627 -0.885346
O  -0.975265 -1.821935 -0.433962
O  -0.461093 -2.021158 1.73391
N  -3.905456 1.405698 -0.324817
C  -4.50512 2.161161 -1.428153
C  -5.378971 3.278331 -0.85948
C  -3.09107 2.245657 0.541078
C  -4.601314 4.195905 0.075774
C  -3.903943 3.375667 1.152602
C  -3.170487 0.236964 -0.780918
C  -3.511839 2.697061 -2.46257
C  -3.13762 -0.875213 0.261123
C  -2.368391 -2.09812 -0.194453
C  -0.141617 -1.802077 0.587624
C  1.253346 -1.492398 0.179023
C  2.226125 -1.461842 1.171932
C  1.609025 -1.232783 -1.141581
C  3.53929 -1.173367 0.850542
C  2.92286 -0.943802 -1.462312
C  3.891057 -0.911328 -0.470348
H  -5.165095 1.463307 -1.953451
H  -6.213824 2.831804 -0.311455
H  -5.815787 3.848352 -1.683048
H  -2.221876 2.665606 0.008496
H  -2.679139 1.628148 1.341976
H  -5.274313 4.927298 0.528808
H  -3.859475 4.769683 -0.487478
H  -3.244583 4.006263 1.753219
H  -4.64888 2.957027 1.835809
H  -3.66357 -0.154047 -1.675243
H  -2.145951 0.496728 -1.086663
H  -2.911476 1.897007 -2.898248
H  -4.052753 3.174775 -3.281241
H  -2.823438 3.437027 -2.052818
H  -2.742667 -0.516672 1.214079
H  -4.158794 -1.211099 0.45798
H  -2.740398 -2.450589 -1.156084
H  -2.467368 -2.915246 0.520988
H  1.964551 -1.662492 2.201847
H  0.875891 -1.2520 -1.934793
H  3.197942 -0.742383 -2.488196
elementType: Cl O N C H
totalener: -1748.07798176 hartree
nucrepener: 1890.92471316 hartree
electener: -3639.00269492 hartree
oneelecener: -6153.84705704 hartree
twoeener: 2514.84436213 hartree
cpcmener: -0.02119870 hartree
kineticenergy: 1743.01466604 hartree
xcener: -123.684049540789 hartree
chargesum: 0.0000000
charge: -0.062029 -0.056229 -0.282284 -0.487438 -0.203209 0.100304 -0.157314 -0.129262 -0.131172 -0.137578 -0.102043 -0.334339 -0.112310 -0.008466 0.555059 -0.006746 -0.140008 -0.205409 0.049978 -0.115037 0.053167 0.059584 0.066922 0.074827 0.081523 0.096683 0.075143 0.073933 0.071667 0.059751 0.091692 0.079443 0.094252 0.095421 0.088295 0.074981 0.073002 0.112285 0.114108 0.127311 0.154249 0.147291
qa: -0.0620 -0.0562 -0.2823 -0.4874 -0.2032 0.1003 -0.1573 -0.1293 -0.1312 -0.1376 -0.1020 -0.3343 -0.1123 -0.0085 0.5551 -0.0067 -0.1400 -0.2054 0.0500 -0.1150 0.0532 0.0596 0.0669 0.0748 0.0815 0.0967 0.0751 0.0739 0.0717 0.0598 0.0917 0.0794 0.0943 0.0954 0.0883 0.0750 0.0730 0.1123 0.1141 0.1273 0.1542 0.1473
va: 1.2549 1.2640 2.1397 2.0152 2.9203 3.9513 3.8939 3.9395 3.8648 3.9201 3.9011 3.9326 3.8309 3.8697 4.0447 3.6324 4.0964 4.0647 3.9732 3.9771 3.9575 1.0056 1.0234 1.0130 1.0027 0.9966 1.0127 1.0067 1.0162 1.0192 0.9993 1.0063 1.0022 1.0084 0.9971 1.0345 1.0296 0.9986 1.0119 1.0415 1.0144 1.0053
dispcorr: -0.019245138 hartree
energy: -1748.097226895100
dipole: -71.00496 70.03320 -0.97176 27.72340 -27.43504 0.28835 -12.06884 10.20673 -1.86211
magnitude: 2.12013 au
magnitude: 5.38893 debye
