program: Orca
programVersion: 5.0.2
elementType: Cl Cl O O N C C C C C C C C C C C C C C C C H H H H H H H H H H H H H H H H H H H H H
charge: 0
multiplicity: 1
keywords: wb97x-d3
keywords: def2-TZVPP
keywords: def2/J RIJCOSX
keywords: DEFGRID2
keywords: scfconv7
keywords: smallprint printgap noloewdin
keywords: NOSOSCF
formula: C16H21Cl2NO2
InChI: InChI=1/C16H21Cl2NO2/c1-12-5-2-3-8-19(12)9-4-10-21-16(20)13-6-7-14(17)15(18)11-13/h6-7,11-12H,2-5,8-10H2,1H3
42 atoms
Cl 3.168905 -0.431328 -2.014941
Cl 4.567661 0.733039 0.542734
O  -1.286342 -2.282715 -0.125469
O  -1.534079 -1.585003 1.992016
N  -2.582089 0.487383 -0.309912
C  -2.701518 1.48199 0.759048
C  -1.388259 2.253992 0.88327
C  -2.261155 1.086267 -1.596078
C  -0.983038 2.909794 -0.430899
C  -0.957873 1.868831 -1.541338
C  -3.741657 -0.386791 -0.387898
C  -3.899096 2.428226 0.628812
C  -3.476215 -1.73339 -1.054024
C  -2.649632 -2.716801 -0.25262
C  -0.887607 -1.671896 0.972973
C  0.487693 -1.124491 0.843154
C  1.136034 -1.074782 -0.385526
C  1.112956 -0.608686 1.973653
C  2.392816 -0.504491 -0.480945
C  2.371541 -0.0461 1.879504
C  3.012578 0.013772 0.65123
H  -2.840991 0.919115 1.687647
H  -0.600828 1.561595 1.194939
H  -1.481094 2.999165 1.676889
H  -3.069973 1.744007 -1.956421
H  -2.168532 0.294216 -2.342006
H  -0.003767 3.38291 -0.329047
H  -1.685177 3.708496 -0.687707
H  -0.782895 2.338764 -2.511654
H  -0.128885 1.175345 -1.372147
H  -4.102792 -0.571192 0.628348
H  -4.577215 0.093959 -0.920256
H  -3.941893 3.091435 1.494203
H  -3.851925 3.058192 -0.260042
H  -4.843557 1.883598 0.595011
H  -4.442439 -2.218169 -1.217493
H  -3.03968 -1.606153 -2.047778
H  -2.596039 -3.671943 -0.773503
H  -3.089414 -2.89804 0.728377
H  0.667917 -1.461339 -1.27955
H  0.620474 -0.638847 2.935518
H  2.856227 0.35448 2.759018
elementType: Cl O N C H
totalener: -1748.07335561 hartree
nucrepener: 2088.00837894 hartree
electener: -3836.08173455 hartree
oneelecener: -6548.94356721 hartree
twoeener: 2712.86183266 hartree
cpcmener: -0.01924986 hartree
kineticenergy: 1743.02849747 hartree
xcener: -123.693567305489 hartree
chargesum: -0.0000000
charge: -0.063901 -0.057306 -0.280262 -0.484864 -0.184281 0.107653 -0.150552 -0.151067 -0.124518 -0.132154 -0.110183 -0.331611 -0.124651 0.014872 0.506303 -0.004956 -0.195886 -0.161547 0.079613 -0.108626 0.042360 0.056397 0.051705 0.081341 0.084199 0.098148 0.073305 0.076698 0.079680 0.052723 0.096828 0.081590 0.095705 0.087708 0.094620 0.086719 0.073681 0.117094 0.097998 0.137358 0.144387 0.147683
qa: -0.0639 -0.0573 -0.2803 -0.4849 -0.1843 0.1077 -0.1506 -0.1511 -0.1245 -0.1322 -0.1102 -0.3316 -0.1247 0.0149 0.5063 -0.0050 -0.1959 -0.1615 0.0796 -0.1086 0.0424 0.0564 0.0517 0.0813 0.0842 0.0981 0.0733 0.0767 0.0797 0.0527 0.0968 0.0816 0.0957 0.0877 0.0946 0.0867 0.0737 0.1171 0.0980 0.1374 0.1444 0.1477
va: 1.2536 1.2634 2.1330 2.0084 2.8378 3.8835 3.9261 3.9554 3.8656 3.9208 3.8988 3.9517 3.8930 3.8270 4.1378 3.5012 4.0411 4.0048 3.9138 3.9802 3.9608 1.0113 1.0309 1.0146 1.0053 0.9980 1.0131 1.0070 1.0170 1.0187 0.9982 1.0046 1.0079 0.9984 1.0021 1.0176 1.0180 0.9988 1.0216 1.0369 1.0226 1.0044
dispcorr: -0.025679364 hartree
energy: -1748.099034975648
dipole: -50.88910 49.79836 -1.09073 12.47949 -12.54272 -0.06324 0.08185 -0.63898 -0.55713
magnitude: 1.22642 au
magnitude: 3.11730 debye
