program: Orca
programVersion: 5.0.2
elementType: Cl Cl O O N C C C C C C C C C C C C C C C C H H H H H H H H H H H H H H H H H H H H H
charge: 0
multiplicity: 1
keywords: wb97x-d3
keywords: def2-TZVPP
keywords: def2/J RIJCOSX
keywords: DEFGRID2
keywords: scfconv7
keywords: smallprint printgap noloewdin
keywords: NOSOSCF
formula: C16H21Cl2NO2
InChI: InChI=1/C16H21Cl2NO2/c1-12-5-2-3-8-19(12)9-4-10-21-16(20)13-6-7-14(17)15(18)11-13/h6-7,11-12H,2-5,8-10H2,1H3
42 atoms
Cl 3.251737 0.351949 2.729665
Cl 5.583276 -0.572791 0.838112
O  -0.914668 -1.845051 0.558319
O  -0.314197 -2.87017 -1.336775
N  -3.357954 1.344332 -1.002408
C  -2.717274 2.657098 -0.940002
C  -3.231028 3.51889 -2.093483
C  -4.806723 1.411696 -0.92756
C  -4.750447 3.633817 -2.094389
C  -5.377875 2.247011 -2.063332
C  -2.787265 0.375752 -0.087345
C  -2.842959 3.37302 0.407507
C  -2.921377 -1.05383 -0.604586
C  -2.313833 -2.08411 0.324484
C  -0.037915 -2.238427 -0.345844
C  1.347999 -1.814205 -0.014982
C  1.626715 -1.021898 1.093292
C  2.383728 -2.213734 -0.853618
C  2.92918 -0.634924 1.357538
C  3.684486 -1.831191 -0.587137
C  3.962271 -1.041282 0.518655
H  -1.64899 2.485288 -1.110822
H  -2.906708 3.068276 -3.036584
H  -2.768397 4.507945 -2.043063
H  -5.157075 1.813276 0.038578
H  -5.210918 0.399262 -0.993632
H  -5.084702 4.185166 -2.976539
H  -5.087651 4.210806 -1.227712
H  -6.463228 2.313284 -1.954248
H  -5.185857 1.735707 -3.012019
H  -1.725793 0.610616 0.027088
H  -3.224445 0.438554 0.923127
H  -2.276495 4.306281 0.391148
H  -3.872738 3.624198 0.664786
H  -2.438715 2.769559 1.222548
H  -3.974799 -1.32742 -0.711945
H  -2.481558 -1.127245 -1.601643
H  -2.464027 -3.095955 -0.054872
H  -2.766093 -2.028321 1.314727
H  0.839776 -0.694113 1.757972
H  2.183262 -2.828418 -1.72024
H  4.487314 -2.145592 -1.239709
elementType: Cl O N C H
totalener: -1748.08884443 hartree
nucrepener: 1904.75389096 hartree
electener: -3652.84273539 hartree
oneelecener: -6181.52139840 hartree
twoeener: 2528.67866301 hartree
cpcmener: -0.01734193 hartree
kineticenergy: 1743.01215554 hartree
xcener: -123.682864778538 hartree
chargesum: 0.0000000
charge: -0.060116 -0.055497 -0.280862 -0.455491 -0.197560 0.096809 -0.159286 -0.122181 -0.126972 -0.140814 -0.107192 -0.326410 -0.098224 -0.012733 0.521418 -0.003935 -0.170350 -0.171095 0.061822 -0.119697 0.040816 0.057738 0.069000 0.073629 0.080187 0.092995 0.075076 0.072834 0.072426 0.060060 0.089209 0.073007 0.094013 0.085936 0.092723 0.081848 0.064558 0.112914 0.113466 0.134128 0.146190 0.145613
qa: -0.0601 -0.0555 -0.2809 -0.4555 -0.1976 0.0968 -0.1593 -0.1222 -0.1270 -0.1408 -0.1072 -0.3264 -0.0982 -0.0127 0.5214 -0.0039 -0.1703 -0.1711 0.0618 -0.1197 0.0408 0.0577 0.0690 0.0736 0.0802 0.0930 0.0751 0.0728 0.0724 0.0601 0.0892 0.0730 0.0940 0.0859 0.0927 0.0818 0.0646 0.1129 0.1135 0.1341 0.1462 0.1456
va: 1.2575 1.2643 2.1362 2.0541 2.9270 3.9553 3.9035 3.9324 3.8603 3.9223 3.9140 3.9350 3.8135 3.8674 4.0970 3.6283 4.0894 4.0616 3.9548 3.9888 3.9687 1.0057 1.0223 1.0130 1.0024 0.9995 1.0128 1.0069 1.0155 1.0199 1.0054 0.9991 1.0087 0.9983 1.0027 1.0226 1.0448 1.0131 0.9977 1.0367 1.0208 1.0062
dispcorr: -0.019405002 hartree
energy: -1748.108249432166
dipole: -65.50457 64.54724 -0.95734 22.10177 -21.83230 0.26947 -19.27879 19.70954 0.43075
magnitude: 1.08381 au
magnitude: 2.75484 debye
