program: Orca
programVersion: 5.0.2
elementType: Cl Cl O O N C C C C C C C C C C C C C C C C H H H H H H H H H H H H H H H H H H H H H
charge: 0
multiplicity: 1
keywords: wb97x-d3
keywords: def2-TZVPP
keywords: def2/J RIJCOSX
keywords: DEFGRID2
keywords: scfconv7
keywords: smallprint printgap noloewdin
keywords: NOSOSCF
formula: C16H21Cl2NO2
InChI: InChI=1/C16H21Cl2NO2/c1-12-5-2-3-8-19(12)9-4-10-21-16(20)13-6-7-14(17)15(18)11-13/h6-7,11-12H,2-5,8-10H2,1H3
42 atoms
Cl 2.726752 0.33178 2.617052
Cl 4.574877 0.723086 0.104804
O  -1.40978 -2.083937 0.622882
O  -1.107409 -2.363418 -1.581282
N  -2.490219 0.392082 -0.677571
C  -2.436751 1.360972 0.421148
C  -1.123708 2.143221 0.355225
C  -2.327832 1.001117 -1.988021
C  -0.912397 2.815849 -0.992872
C  -1.026162 1.778231 -2.098995
C  -3.661632 -0.469879 -0.655603
C  -3.644555 2.300194 0.510911
C  -3.756742 -1.394037 0.553163
C  -2.768722 -2.542746 0.581388
C  -0.732857 -1.966957 -0.503894
C  0.59662 -1.33246 -0.304143
C  1.013898 -0.874487 0.93963
C  1.423329 -1.166299 -1.410418
C  2.239202 -0.243666 1.070269
C  2.64648 -0.536581 -1.28087
C  3.057852 -0.069518 -0.04122
H  -2.4079 0.789044 1.353225
H  -0.293557 1.45708 0.543663
H  -1.108568 2.87799 1.16416
H  -3.169669 1.665075 -2.249208
H  -2.334402 0.202031 -2.734155
H  0.06527 3.303017 -1.021058
H  -1.65406 3.606391 -1.146305
H  -0.972281 2.247043 -3.084535
H  -0.185242 1.08131 -2.034002
H  -4.597688 0.10622 -0.72428
H  -3.636366 -1.087515 -1.557955
H  -4.569556 1.760614 0.719856
H  -3.504281 3.012488 1.325923
H  -3.80392 2.877811 -0.400978
H  -3.706068 -0.833484 1.48949
H  -4.748638 -1.854651 0.541228
H  -2.91979 -3.211429 -0.26698
H  -2.900828 -3.127233 1.492007
H  0.388183 -0.987052 1.813818
H  1.112799 -1.51731 -2.384796
H  3.282634 -0.403051 -2.14512
elementType: Cl O N C H
totalener: -1748.08492867 hartree
nucrepener: 2095.55711089 hartree
electener: -3843.64203957 hartree
oneelecener: -6563.87235305 hartree
twoeener: 2720.23031348 hartree
cpcmener: -0.01567552 hartree
kineticenergy: 1743.02329234 hartree
xcener: -123.693827236646 hartree
chargesum: -0.0000000
charge: -0.062572 -0.056258 -0.275436 -0.455062 -0.176994 0.059672 -0.141481 -0.130831 -0.120717 -0.138835 -0.128436 -0.331009 -0.117091 0.003674 0.499559 -0.002757 -0.195002 -0.189275 0.093756 -0.095759 0.029280 0.069381 0.054650 0.080162 0.087139 0.087919 0.073258 0.075194 0.078745 0.055165 0.093094 0.094719 0.092769 0.093977 0.090925 0.078776 0.087893 0.099436 0.112748 0.133372 0.146181 0.146071
qa: -0.0626 -0.0563 -0.2754 -0.4551 -0.1770 0.0597 -0.1415 -0.1308 -0.1207 -0.1388 -0.1284 -0.3310 -0.1171 0.0037 0.4996 -0.0028 -0.1950 -0.1893 0.0938 -0.0958 0.0293 0.0694 0.0546 0.0802 0.0871 0.0879 0.0733 0.0752 0.0787 0.0552 0.0931 0.0947 0.0928 0.0940 0.0909 0.0788 0.0879 0.0994 0.1127 0.1334 0.1462 0.1461
va: 1.2550 1.2640 2.1288 2.0487 2.8486 3.9431 3.9247 3.9126 3.8672 3.9278 3.8755 3.9538 3.8587 3.8534 4.1498 3.5087 4.0504 4.0201 3.8948 3.9638 3.9710 1.0001 1.0286 1.0150 1.0033 1.0072 1.0130 1.0076 1.0179 1.0234 1.0022 1.0074 1.0016 1.0085 0.9990 1.0114 1.0174 1.0195 0.9999 1.0400 1.0233 1.0050
dispcorr: -0.026070123 hartree
energy: -1748.110998798252
dipole: -49.17797 47.95400 -1.22397 10.08390 -9.91547 0.16843 -12.61401 12.87875 0.26475
magnitude: 1.26355 au
magnitude: 3.21169 debye
