program: Orca
programVersion: 5.0.2
elementType: Cl Cl O O N C C C C C C C C C C C C C C C C H H H H H H H H H H H H H H H H H H H H H
charge: 0
multiplicity: 1
keywords: wb97x-d3
keywords: def2-TZVPP
keywords: def2/J RIJCOSX
keywords: DEFGRID2
keywords: scfconv7
keywords: smallprint printgap noloewdin
keywords: NOSOSCF
formula: C16H21Cl2NO2
InChI: InChI=1/C16H21Cl2NO2/c1-12-5-2-3-8-19(12)9-4-10-21-16(20)13-6-7-14(17)15(18)11-13/h6-7,11-12H,2-5,8-10H2,1H3
42 atoms
Cl 4.162512 -0.913589 -1.548434
Cl 5.487961 -0.48678 1.266066
O  -0.755127 -1.99285 -0.340474
O  -1.040745 -1.826193 1.876228
N  -3.350749 1.43241 -0.896311
C  -2.850231 2.674236 -0.307876
C  -3.299286 3.856561 -1.166536
C  -4.797261 1.401381 -1.022764
C  -4.81079 3.888899 -1.355567
C  -5.297107 2.548068 -1.888039
C  -2.808315 0.243809 -0.267727
C  -3.204776 2.877481 1.167962
C  -2.756302 -0.943303 -1.224068
C  -2.152023 -2.193013 -0.620208
C  -0.339817 -1.783205 0.894299
C  1.115105 -1.479173 0.95076
C  1.884249 -1.366888 -0.202431
C  1.706733 -1.282618 2.194471
C  3.230641 -1.060095 -0.109175
C  3.051936 -0.980715 2.287551
C  3.818415 -0.867427 1.137129
H  -1.757802 2.622542 -0.368607
H  -2.817654 3.780857 -2.146423
H  -2.946018 4.787395 -0.715535
H  -5.303561 1.430638 -0.042945
H  -5.091493 0.455185 -1.481731
H  -5.087182 4.695289 -2.039086
H  -5.307227 4.11017 -0.405645
H  -6.388502 2.519522 -1.932098
H  -4.934216 2.406515 -2.910894
H  -1.791576 0.48486 0.053981
H  -3.36029 -0.04537 0.641133
H  -2.732031 3.786291 1.545224
H  -4.27752 2.974472 1.340429
H  -2.846518 2.0521 1.785993
H  -3.76297 -1.21915 -1.549242
H  -2.204255 -0.664309 -2.125403
H  -2.187277 -3.014559 -1.335028
H  -2.684678 -2.506142 0.278347
H  1.447595 -1.510434 -1.180781
H  1.121727 -1.363936 3.100126
H  3.508746 -0.830179 3.256116
elementType: Cl O N C H
totalener: -1748.08842303 hartree
nucrepener: 1909.52659958 hartree
electener: -3657.61502261 hartree
oneelecener: -6191.16035420 hartree
twoeener: 2533.54533158 hartree
cpcmener: -0.01702399 hartree
kineticenergy: 1743.01363976 hartree
xcener: -123.683504883646 hartree
chargesum: 0.0000000
charge: -0.060090 -0.055257 -0.276874 -0.452664 -0.195991 0.093096 -0.158284 -0.122716 -0.126150 -0.140829 -0.121364 -0.326096 -0.065431 -0.016813 0.508006 -0.008489 -0.161764 -0.171823 0.064693 -0.115891 0.036728 0.058079 0.068508 0.073761 0.080605 0.093818 0.074789 0.072628 0.072251 0.059538 0.092827 0.075269 0.093357 0.086473 0.093566 0.072260 0.059926 0.116459 0.105588 0.133370 0.145663 0.145268
qa: -0.0601 -0.0553 -0.2769 -0.4527 -0.1960 0.0931 -0.1583 -0.1227 -0.1262 -0.1408 -0.1214 -0.3261 -0.0654 -0.0168 0.5080 -0.0085 -0.1618 -0.1718 0.0647 -0.1159 0.0367 0.0581 0.0685 0.0738 0.0806 0.0938 0.0748 0.0726 0.0723 0.0595 0.0928 0.0753 0.0934 0.0865 0.0936 0.0723 0.0599 0.1165 0.1056 0.1334 0.1457 0.1453
va: 1.2574 1.2649 2.1342 2.0554 2.9428 3.9563 3.9041 3.9328 3.8591 3.9216 3.9600 3.9363 3.8186 3.8719 4.1061 3.6329 4.0903 4.0616 3.9509 3.9849 3.9709 1.0063 1.0220 1.0131 1.0024 0.9990 1.0127 1.0076 1.0155 1.0203 0.9924 1.0015 1.0092 0.9985 1.0027 1.0224 1.0337 1.0001 1.0173 1.0392 1.0209 1.0061
dispcorr: -0.019635978 hartree
energy: -1748.108059011269
dipole: -68.53689 67.64208 -0.89481 25.19182 -25.20041 -0.00859 -5.51928 5.35442 -0.16487
magnitude: 0.90991 au
magnitude: 2.31282 debye
