program: Orca
programVersion: 5.0.2
elementType: Cl Cl O O N C C C C C C C C C C C C C C C C H H H H H H H H H H H H H H H H H H H H H
charge: 0
multiplicity: 1
keywords: wb97x-d3
keywords: def2-TZVPP
keywords: def2/J RIJCOSX
keywords: DEFGRID2
keywords: scfconv7
keywords: smallprint printgap noloewdin
keywords: NOSOSCF
formula: C16H21Cl2NO2
InChI: InChI=1/C16H21Cl2NO2/c1-12-5-2-3-8-19(12)9-4-10-21-16(20)13-6-7-14(17)15(18)11-13/h6-7,11-12H,2-5,8-10H2,1H3
42 atoms
Cl 4.318061 -3.11906 -0.853096
Cl 5.860189 -1.750196 1.519346
O  -0.229274 -0.579617 -0.860231
O  -0.150966 1.03941 0.680598
N  -4.118391 1.224226 -0.958352
C  -3.915005 1.885083 0.332014
C  -3.845684 3.397487 0.113414
C  -5.322772 1.662397 -1.641121
C  -5.074631 3.936082 -0.60708
C  -5.297059 3.161419 -1.898179
C  -4.008614 -0.221743 -0.928797
C  -4.930533 1.512338 1.415951
C  -2.646636 -0.727302 -0.463573
C  -1.527578 -0.155278 -1.31318
C  0.349402 0.09897 0.111654
C  1.711524 -0.400263 0.43571
C  2.311605 -1.430017 -0.28012
C  2.400844 0.20224 1.483839
C  3.589723 -1.84792 0.049568
C  3.674004 -0.218085 1.815598
C  4.27428 -1.243028 1.099519
H  -2.931808 1.580776 0.699237
H  -2.954123 3.623551 -0.479979
H  -3.711673 3.89449 1.077502
H  -6.241709 1.399305 -1.090403
H  -5.383918 1.133202 -2.595865
H  -4.952785 5.001689 -0.816011
H  -5.957805 3.848528 0.033242
H  -6.231532 3.463045 -2.377413
H  -4.491181 3.387849 -2.60346
H  -4.785323 -0.701512 -0.312573
H  -4.179013 -0.580085 -1.948787
H  -5.951374 1.804011 1.165494
H  -4.937341 0.439233 1.615529
H  -4.672342 2.007137 2.354032
H  -2.489145 -0.4982 0.59248
H  -2.647914 -1.817052 -0.544524
H  -1.568931 0.932675 -1.35452
H  -1.597882 -0.529735 -2.334513
H  1.797981 -1.91507 -1.098381
H  1.947448 1.004258 2.049718
H  4.204946 0.250907 2.632657
elementType: Cl O N C H
totalener: -1748.08802241 hartree
nucrepener: 1891.64488784 hartree
electener: -3639.73291026 hartree
oneelecener: -6155.66348259 hartree
twoeener: 2515.93057234 hartree
cpcmener: -0.01513649 hartree
kineticenergy: 1743.00785646 hartree
xcener: -123.685281195508 hartree
chargesum: -0.0000000
charge: -0.060665 -0.055019 -0.280754 -0.463259 -0.192221 0.085031 -0.168955 -0.125612 -0.121434 -0.132819 -0.131275 -0.329893 -0.132906 0.010267 0.542477 -0.013534 -0.172774 -0.164421 0.062725 -0.127546 0.046576 0.060755 0.074081 0.074368 0.075393 0.084849 0.074817 0.071729 0.073193 0.057186 0.089094 0.095834 0.088844 0.093773 0.095865 0.086281 0.092081 0.098236 0.115992 0.131674 0.147589 0.144377
qa: -0.0607 -0.0550 -0.2808 -0.4633 -0.1922 0.0850 -0.1690 -0.1256 -0.1214 -0.1328 -0.1313 -0.3299 -0.1329 0.0103 0.5425 -0.0135 -0.1728 -0.1644 0.0627 -0.1275 0.0466 0.0608 0.0741 0.0744 0.0754 0.0848 0.0748 0.0717 0.0732 0.0572 0.0891 0.0958 0.0888 0.0938 0.0959 0.0863 0.0921 0.0982 0.1160 0.1317 0.1476 0.1444
va: 1.2566 1.2649 2.1563 2.0473 2.8709 3.9055 3.9429 3.9603 3.8543 3.9078 3.9365 3.9616 3.8226 3.8065 4.0449 3.6419 4.0988 4.0494 3.9470 3.9977 3.9650 1.0150 1.0146 1.0136 0.9972 1.0032 1.0135 1.0075 1.0148 1.0215 0.9993 0.9976 0.9980 1.0016 1.0074 1.0169 1.0181 1.0356 1.0028 1.0380 1.0212 1.0073
dispcorr: -0.020076653 hartree
energy: -1748.108099067500
dipole: -77.72876 76.61876 -1.11000 32.80753 -32.92630 -0.11876 -5.83874 5.67759 -0.16116
magnitude: 1.12790 au
magnitude: 2.86691 debye
