program: Orca
programVersion: 5.0.2
elementType: Cl Cl O O N C C C C C C C C C C C C C C C C H H H H H H H H H H H H H H H H H H H H H
charge: 0
multiplicity: 1
keywords: wb97x-d3
keywords: def2-TZVPP
keywords: def2/J RIJCOSX
keywords: DEFGRID2
keywords: scfconv7
keywords: smallprint printgap noloewdin
keywords: NOSOSCF
formula: C16H21Cl2NO2
InChI: InChI=1/C16H21Cl2NO2/c1-12-5-2-3-8-19(12)9-4-10-21-16(20)13-6-7-14(17)15(18)11-13/h6-7,11-12H,2-5,8-10H2,1H3
42 atoms
Cl 4.699978 0.141024 -0.955601
Cl 6.006342 -2.289753 0.545878
O  -0.248014 -0.115718 0.543451
O  -0.534362 -1.8632 1.91081
N  -4.044545 1.446638 -0.637529
C  -5.114109 2.18339 0.030983
C  -4.952015 3.674055 -0.268727
C  -4.032858 1.630555 -2.077515
C  -4.91832 3.960059 -1.765635
C  -3.860411 3.097462 -2.441783
C  -3.952116 0.0526 -0.247429
C  -6.529652 1.687462 -0.280957
C  -2.523392 -0.485101 -0.30044
C  -1.624102 0.284677 0.64716
C  0.168036 -1.175442 1.210215
C  1.619833 -1.429665 1.01601
C  2.400929 -0.616845 0.201874
C  2.203143 -2.506203 1.676921
C  3.751324 -0.879087 0.054041
C  3.551961 -2.767271 1.529632
C  4.330988 -1.95537 0.718665
H  -4.956499 2.046714 1.106214
H  -4.017551 4.020746 0.183402
H  -5.758825 4.232501 0.2129
H  -4.945592 1.235293 -2.555114
H  -3.203985 1.056956 -2.498705
H  -4.714049 5.019279 -1.939891
H  -5.897491 3.760879 -2.211581
H  -3.905771 3.208517 -3.527833
H  -2.864287 3.427624 -2.130861
H  -4.316103 -0.04366 0.779872
H  -4.596011 -0.598456 -0.857926
H  -6.807037 1.814171 -1.328392
H  -6.647725 0.629943 -0.036876
H  -7.26056 2.23661 0.315749
H  -2.547442 -1.543455 -0.030985
H  -2.124526 -0.4276 -1.316555
H  -1.965703 0.190139 1.680405
H  -1.619136 1.341685 0.390876
H  1.970718 0.224884 -0.322147
H  1.607728 -3.146689 2.312978
H  4.004168 -3.603568 2.044874
elementType: Cl O N C H
totalener: -1748.08829415 hartree
nucrepener: 1861.73542411 hartree
electener: -3609.82371827 hartree
oneelecener: -6095.51197770 hartree
twoeener: 2485.68825944 hartree
cpcmener: -0.01512052 hartree
kineticenergy: 1743.01390220 hartree
xcener: -123.683927980120 hartree
chargesum: 0.0000000
charge: -0.060227 -0.055539 -0.277383 -0.460771 -0.204435 0.110825 -0.168774 -0.121980 -0.124701 -0.145836 -0.117074 -0.329431 -0.129246 0.031373 0.523367 -0.008565 -0.171582 -0.167276 0.063194 -0.122521 0.041749 0.055048 0.070823 0.073723 0.080206 0.093157 0.074913 0.072879 0.072060 0.061898 0.098398 0.086116 0.085886 0.093263 0.094685 0.091092 0.070791 0.098471 0.098610 0.133656 0.144691 0.144467
qa: -0.0602 -0.0555 -0.2774 -0.4608 -0.2044 0.1108 -0.1688 -0.1220 -0.1247 -0.1458 -0.1171 -0.3294 -0.1292 0.0314 0.5234 -0.0086 -0.1716 -0.1673 0.0632 -0.1225 0.0417 0.0550 0.0708 0.0737 0.0802 0.0932 0.0749 0.0729 0.0721 0.0619 0.0984 0.0861 0.0859 0.0933 0.0947 0.0911 0.0708 0.0985 0.0986 0.1337 0.1447 0.1445
va: 1.2573 1.2645 2.1528 2.0476 2.8736 3.9295 3.9250 3.9395 3.8571 3.9330 3.9327 3.9432 3.8500 3.7879 4.0832 3.6483 4.0997 4.0576 3.9493 3.9918 3.9670 1.0049 1.0186 1.0133 1.0027 0.9999 1.0133 1.0066 1.0161 1.0162 0.9934 1.0021 0.9982 1.0028 1.0089 1.0302 1.0198 1.0128 1.0397 1.0382 1.0213 1.0068
dispcorr: -0.019199901 hartree
energy: -1748.107494055239
dipole: -80.88006 79.69870 -1.18136 26.66191 -26.28660 0.37531 -8.67111 8.34378 -0.32732
magnitude: 1.28203 au
magnitude: 3.25867 debye
