program: Orca
programVersion: 5.0.2
elementType: Cl Cl O O N C C C C C C C C C C C C C C C C H H H H H H H H H H H H H H H H H H H H H
charge: 0
multiplicity: 1
keywords: wb97x-d3
keywords: def2-TZVPP
keywords: def2/J RIJCOSX
keywords: DEFGRID2
keywords: scfconv7
keywords: smallprint printgap noloewdin
keywords: NOSOSCF
formula: C16H21Cl2NO2
InChI: InChI=1/C16H21Cl2NO2/c1-12-5-2-3-8-19(12)9-4-10-21-16(20)13-6-7-14(17)15(18)11-13/h6-7,11-12H,2-5,8-10H2,1H3
42 atoms
Cl 3.85643 -3.773854 0.266065
Cl 6.164429 -1.642331 0.303708
O  -0.413164 -0.819285 0.038987
O  0.177901 1.336402 0.112636
N  -4.067309 1.331459 -0.41196
C  -5.452439 1.381478 0.050077
C  -5.564133 2.403301 1.182037
C  -3.570651 2.610462 -0.887067
C  -5.058832 3.778659 0.764851
C  -3.647956 3.667144 0.204196
C  -3.794777 0.23538 -1.320223
C  -6.490018 1.632436 -1.048556
C  -2.31923 -0.157094 -1.355572
C  -1.813087 -0.489984 0.033964
C  0.465095 0.163181 0.093786
C  1.868624 -0.325986 0.14014
C  2.175808 -1.682033 0.170376
C  2.895546 0.612441 0.163438
C  3.497183 -2.091214 0.224285
C  4.214293 0.203887 0.214149
C  4.520538 -1.148515 0.244441
H  -5.669575 0.395394 0.474898
H  -4.974763 2.047672 2.032886
H  -6.601811 2.458714 1.520934
H  -4.110408 2.960976 -1.783119
H  -2.528083 2.4956 -1.190082
H  -5.079346 4.462145 1.617088
H  -5.722081 4.211609 0.009524
H  -3.31234 4.626212 -0.197578
H  -2.952944 3.399196 1.006395
H  -4.375511 -0.629331 -0.984799
H  -4.121472 0.441534 -2.351629
H  -6.440852 0.870512 -1.828736
H  -7.497578 1.595692 -0.629998
H  -6.37493 2.60326 -1.532416
H  -2.212525 -1.027148 -2.008286
H  -1.719558 0.638337 -1.802586
H  -2.307092 -1.383859 0.415582
H  -2.007821 0.323636 0.731553
H  1.396799 -2.431436 0.156134
H  2.672246 1.67001 0.141509
H  5.009549 0.936562 0.231329
elementType: Cl O N C H
totalener: -1748.08821973 hartree
nucrepener: 1880.86873159 hartree
electener: -3628.95695132 hartree
oneelecener: -6134.15177115 hartree
twoeener: 2505.19481983 hartree
cpcmener: -0.01554709 hartree
kineticenergy: 1743.01308432 hartree
xcener: -123.685146243070 hartree
chargesum: 0.0000000
charge: -0.060465 -0.055630 -0.280153 -0.463273 -0.195376 0.099034 -0.165361 -0.132495 -0.122822 -0.139564 -0.109088 -0.329607 -0.157923 0.026312 0.536737 -0.012472 -0.172807 -0.163489 0.062578 -0.127585 0.045627 0.057242 0.070256 0.073998 0.086035 0.092539 0.074769 0.072057 0.072449 0.061572 0.097030 0.081949 0.093677 0.094197 0.085765 0.088789 0.085403 0.114639 0.091618 0.132787 0.146458 0.144597
qa: -0.0605 -0.0556 -0.2802 -0.4633 -0.1954 0.0990 -0.1654 -0.1325 -0.1228 -0.1396 -0.1091 -0.3296 -0.1579 0.0263 0.5367 -0.0125 -0.1728 -0.1635 0.0626 -0.1276 0.0456 0.0572 0.0703 0.0740 0.0860 0.0925 0.0748 0.0721 0.0724 0.0616 0.0970 0.0819 0.0937 0.0942 0.0858 0.0888 0.0854 0.1146 0.0916 0.1328 0.1465 0.1446
va: 1.2568 1.2643 2.1569 2.0446 2.8696 3.9405 3.9161 3.9280 3.8563 3.9359 3.9350 3.9375 3.8528 3.7977 4.0533 3.6441 4.0993 4.0528 3.9486 3.9961 3.9648 1.0054 1.0195 1.0132 1.0048 1.0063 1.0135 1.0066 1.0161 1.0173 0.9940 1.0023 1.0020 1.0090 0.9987 1.0217 1.0176 1.0015 1.0445 1.0379 1.0213 1.0070
dispcorr: -0.019805404 hartree
energy: -1748.108025137218
dipole: -78.55586 77.37030 -1.18556 36.28875 -36.28678 0.00197 -6.22841 5.84903 -0.37938
magnitude: 1.24478 au
magnitude: 3.16399 debye
