program: Orca
programVersion: 5.0.2
elementType: Cl Cl O O N C C C C C C C C C C C C C C C C H H H H H H H H H H H H H H H H H H H H H
charge: 0
multiplicity: 1
keywords: wb97x-d3
keywords: def2-TZVPP
keywords: def2/J RIJCOSX
keywords: DEFGRID2
keywords: scfconv7
keywords: smallprint printgap noloewdin
keywords: NOSOSCF
formula: C16H21Cl2NO2
InChI: InChI=1/C16H21Cl2NO2/c1-12-5-2-3-8-19(12)9-4-10-21-16(20)13-6-7-14(17)15(18)11-13/h6-7,11-12H,2-5,8-10H2,1H3
42 atoms
Cl 4.556731 0.613056 -0.646168
Cl 5.167461 -1.049477 1.950365
O  -1.127059 -1.924935 0.095196
O  -0.496388 -0.569493 -1.576279
N  -3.46087 0.897312 -0.316497
C  -2.66047 2.107773 -0.489219
C  -2.881704 2.656888 -1.898943
C  -4.881453 1.107489 -0.52551
C  -4.356222 2.903899 -2.192953
C  -5.159322 1.63936 -1.923249
C  -3.171105 0.166959 0.900123
C  -2.87706 3.1791 0.583189
C  -3.376693 -1.337553 0.750313
C  -2.509965 -1.984717 -0.306734
C  -0.259813 -1.186378 -0.565152
C  1.079822 -1.187325 0.083619
C  2.079393 -0.412229 -0.492388
C  1.354403 -1.918137 1.235906
C  3.338486 -0.36273 0.077892
C  2.614869 -1.872838 1.803038
C  3.609847 -1.096489 1.229173
H  -1.613036 1.796582 -0.42084
H  -2.488313 1.932279 -2.618771
H  -2.30207 3.574461 -2.027862
H  -5.317045 1.792718 0.222062
H  -5.401352 0.15558 -0.394975
H  -4.485537 3.227386 -3.228632
H  -4.735161 3.719776 -1.569309
H  -6.230321 1.82657 -2.033858
H  -4.892783 0.871551 -2.656503
H  -2.131931 0.357914 1.183468
H  -3.774996 0.51435 1.753013
H  -2.672362 2.791364 1.583098
H  -2.196041 4.016934 0.420698
H  -3.890921 3.581546 0.589785
H  -3.201942 -1.818566 1.716736
H  -4.415604 -1.558919 0.491258
H  -2.651061 -1.517397 -1.279571
H  -2.744388 -3.045377 -0.399929
H  1.88058 0.160715 -1.38803
H  0.59878 -2.529928 1.707429
H  2.825486 -2.443397 2.69718
elementType: Cl O N C H
totalener: -1748.08806776 hartree
nucrepener: 1952.51010865 hartree
electener: -3700.59817641 hartree
oneelecener: -6277.67782550 hartree
twoeener: 2577.07964909 hartree
cpcmener: -0.01766618 hartree
kineticenergy: 1743.01305206 hartree
xcener: -123.684697011289 hartree
chargesum: -0.0000000
charge: -0.060492 -0.055363 -0.277321 -0.457756 -0.188633 0.089834 -0.158122 -0.131438 -0.121248 -0.139949 -0.116274 -0.327277 -0.108474 0.005328 0.514383 0.000590 -0.143148 -0.202633 0.055213 -0.113460 0.048820 0.048677 0.069515 0.073669 0.078834 0.092048 0.074924 0.071365 0.072419 0.060064 0.092796 0.092982 0.092104 0.094710 0.085887 0.082289 0.072037 0.091682 0.117953 0.127867 0.150915 0.144686
qa: -0.0605 -0.0554 -0.2773 -0.4578 -0.1886 0.0898 -0.1581 -0.1314 -0.1212 -0.1399 -0.1163 -0.3273 -0.1085 0.0053 0.5144 0.0006 -0.1431 -0.2026 0.0552 -0.1135 0.0488 0.0487 0.0695 0.0737 0.0788 0.0920 0.0749 0.0714 0.0724 0.0601 0.0928 0.0930 0.0921 0.0947 0.0859 0.0823 0.0720 0.0917 0.1180 0.1279 0.1509 0.1447
va: 1.2560 1.2647 2.1435 2.0491 2.8380 3.9298 3.9203 3.9599 3.8542 3.9255 3.8932 3.9520 3.8897 3.8095 4.0836 3.6263 4.0944 4.0624 3.9668 3.9743 3.9631 1.0105 1.0221 1.0133 1.0023 0.9990 1.0133 1.0075 1.0151 1.0182 0.9972 1.0041 1.0026 1.0082 0.9988 1.0213 1.0176 1.0463 1.0011 1.0419 1.0173 1.0064
dispcorr: -0.021232110 hartree
energy: -1748.109299866780
dipole: -68.87921 67.42541 -1.45380 16.69814 -17.44535 -0.74720 -6.64549 7.94503 1.29953
magnitude: 2.08821 au
magnitude: 5.30782 debye
