program: Orca
programVersion: 5.0.2
elementType: Cl Cl O O N C C C C C C C C C C C C C C C C H H H H H H H H H H H H H H H H H H H H H
charge: 0
multiplicity: 1
keywords: wb97x-d3
keywords: def2-TZVPP
keywords: def2/J RIJCOSX
keywords: DEFGRID2
keywords: scfconv7
keywords: smallprint printgap noloewdin
keywords: NOSOSCF
formula: C16H21Cl2NO2
InChI: InChI=1/C16H21Cl2NO2/c1-12-5-2-3-8-19(12)9-4-10-21-16(20)13-6-7-14(17)15(18)11-13/h6-7,11-12H,2-5,8-10H2,1H3
42 atoms
Cl 3.459655 -3.363118 1.004208
Cl 5.317983 -0.972824 1.851372
O  -0.443776 -0.961771 -1.417178
O  -0.061251 1.246275 -1.449673
N  -3.470004 1.042711 -0.447185
C  -3.062692 2.144809 0.423566
C  -3.36994 3.473543 -0.268232
C  -4.877916 1.082577 -0.801838
C  -4.833432 3.585373 -0.677554
C  -5.231321 2.378269 -1.515531
C  -3.051419 -0.26103 0.028996
C  -3.640661 2.093377 1.841187
C  -2.822427 -1.261283 -1.100816
C  -1.72491 -0.87567 -2.068704
C  0.252294 0.122365 -1.139817
C  1.502589 -0.189262 -0.394667
C  1.861219 -1.494106 -0.073913
C  2.327414 0.863749 -0.011262
C  3.034173 -1.74032 0.618788
C  3.496837 0.61826 0.682293
C  3.856896 -0.683506 0.997125
H  -1.974734 2.07293 0.521621
H  -2.740601 3.556483 -1.159813
H  -3.088819 4.298784 0.390905
H  -5.532501 0.957015 0.077462
H  -5.100173 0.240348 -1.460628
H  -4.998981 4.510817 -1.234351
H  -5.472174 3.644873 0.20928
H  -6.301829 2.390966 -1.733645
H  -4.710522 2.410697 -2.477407
H  -2.122524 -0.144105 0.595041
H  -3.772277 -0.699052 0.737032
H  -3.366034 1.169451 2.353474
H  -3.244142 2.917886 2.436807
H  -4.728595 2.170024 1.866525
H  -2.604845 -2.242163 -0.669457
H  -3.735632 -1.391989 -1.687191
H  -1.886652 0.120499 -2.477153
H  -1.67853 -1.5819 -2.89754
H  1.23651 -2.329607 -0.356786
H  2.061643 1.884369 -0.249497
H  4.134392 1.439685 0.979176
elementType: Cl O N C H
totalener: -1748.08834161 hartree
nucrepener: 1941.58957913 hartree
electener: -3689.67792075 hartree
oneelecener: -6255.75356662 hartree
twoeener: 2566.07564587 hartree
cpcmener: -0.01744485 hartree
kineticenergy: 1743.00661045 hartree
xcener: -123.683341635723 hartree
chargesum: -0.0000000
charge: -0.060710 -0.055428 -0.277018 -0.456359 -0.189545 0.092577 -0.157880 -0.133397 -0.122919 -0.141167 -0.118382 -0.329200 -0.110711 0.004469 0.514629 -0.004121 -0.167911 -0.168998 0.066234 -0.119871 0.038819 0.049165 0.070084 0.073738 0.079331 0.092381 0.074671 0.072080 0.072673 0.060966 0.094926 0.092957 0.092659 0.095079 0.086271 0.082305 0.072481 0.091832 0.118567 0.133663 0.145698 0.145362
qa: -0.0607 -0.0554 -0.2770 -0.4564 -0.1895 0.0926 -0.1579 -0.1334 -0.1229 -0.1412 -0.1184 -0.3292 -0.1107 0.0045 0.5146 -0.0041 -0.1679 -0.1690 0.0662 -0.1199 0.0388 0.0492 0.0701 0.0737 0.0793 0.0924 0.0747 0.0721 0.0727 0.0610 0.0949 0.0930 0.0927 0.0951 0.0863 0.0823 0.0725 0.0918 0.1186 0.1337 0.1457 0.1454
va: 1.2565 1.2645 2.1419 2.0511 2.8450 3.9286 3.9170 3.9615 3.8553 3.9248 3.8942 3.9480 3.8923 3.8055 4.0793 3.6428 4.0915 4.0553 3.9475 3.9883 3.9695 1.0121 1.0215 1.0132 1.0025 0.9997 1.0134 1.0074 1.0153 1.0183 0.9944 1.0045 1.0025 1.0081 0.9988 1.0216 1.0178 1.0468 1.0007 1.0388 1.0212 1.0064
dispcorr: -0.020961938 hartree
energy: -1748.109303553214
dipole: -67.68807 66.62363 -1.06443 29.16880 -29.44225 -0.27345 -9.79329 9.85714 0.06385
magnitude: 1.10085 au
magnitude: 2.79814 debye
