program: Orca
programVersion: 5.0.2
elementType: Cl Cl O O N C C C C C C C C C C C C C C C C H H H H H H H H H H H H H H H H H H H H H
charge: 0
multiplicity: 1
keywords: wb97x-d3
keywords: def2-TZVPP
keywords: def2/J RIJCOSX
keywords: DEFGRID2
keywords: scfconv7
keywords: smallprint printgap noloewdin
keywords: NOSOSCF
formula: C16H21Cl2NO2
InChI: InChI=1/C16H21Cl2NO2/c1-12-5-2-3-8-19(12)9-4-10-21-16(20)13-6-7-14(17)15(18)11-13/h6-7,11-12H,2-5,8-10H2,1H3
42 atoms
Cl 5.399646 -2.109683 -0.937599
Cl 5.71816 -1.498347 2.128476
O  -0.576287 -0.595653 0.224373
O  0.323229 -0.9336 -1.790221
N  -4.338386 1.36346 -0.467098
C  -4.57184 2.502892 0.417171
C  -4.252623 3.79122 -0.343527
C  -5.158444 1.386139 -1.664099
C  -5.048696 3.897454 -1.640463
C  -4.867278 2.638456 -2.479226
C  -4.266336 0.084224 0.211644
C  -5.969005 2.551265 1.046021
C  -2.872381 -0.200985 0.76767
C  -1.875521 -0.380831 -0.354976
C  0.429059 -0.847335 -0.590074
C  1.722239 -1.009953 0.126168
C  2.824052 -1.422243 -0.614756
C  1.8655 -0.750202 1.485992
C  4.054042 -1.58267 -0.003433
C  3.098704 -0.898622 2.094576
C  4.195285 -1.315998 1.355489
H  -3.853118 2.420336 1.239039
H  -3.18304 3.804739 -0.574588
H  -4.446725 4.654673 0.297832
H  -6.238847 1.3276 -1.451467
H  -4.918686 0.502898 -2.260543
H  -4.732049 4.779155 -2.202916
H  -6.110984 4.042366 -1.421147
H  -5.515172 2.662638 -3.358435
H  -3.836721 2.587716 -2.844354
H  -4.996651 -0.008672 1.026729
H  -4.525833 -0.704236 -0.500199
H  -6.204104 1.634788 1.589746
H  -6.026438 3.37007 1.765504
H  -6.761598 2.707068 0.313224
H  -2.556073 0.610506 1.428752
H  -2.914982 -1.109093 1.37496
H  -1.844225 0.503228 -0.99345
H  -2.146937 -1.240466 -0.973346
H  2.725633 -1.626825 -1.672463
H  1.027318 -0.423527 2.085055
H  3.210417 -0.687627 3.149247
elementType: Cl O N C H
totalener: -1748.08737129 hartree
nucrepener: 1851.94696919 hartree
electener: -3600.03434048 hartree
oneelecener: -6075.96053699 hartree
twoeener: 2475.92619651 hartree
cpcmener: -0.01668564 hartree
kineticenergy: 1742.99900184 hartree
xcener: -123.681265042672 hartree
chargesum: -0.0000000
charge: -0.060269 -0.055594 -0.276006 -0.460930 -0.216405 0.094230 -0.168693 -0.107110 -0.123820 -0.147230 -0.117266 -0.330220 -0.095552 0.024077 0.522589 -0.003082 -0.127023 -0.207276 0.042473 -0.116758 0.054767 0.066040 0.071203 0.073570 0.081695 0.082677 0.075787 0.072054 0.072510 0.061635 0.096029 0.090868 0.092314 0.094106 0.085329 0.069409 0.081020 0.088545 0.094600 0.127342 0.154034 0.144333
qa: -0.0603 -0.0556 -0.2760 -0.4609 -0.2164 0.0942 -0.1687 -0.1071 -0.1238 -0.1472 -0.1173 -0.3302 -0.0956 0.0241 0.5226 -0.0031 -0.1270 -0.2073 0.0425 -0.1168 0.0548 0.0660 0.0712 0.0736 0.0817 0.0827 0.0758 0.0721 0.0725 0.0616 0.0960 0.0909 0.0923 0.0941 0.0853 0.0694 0.0810 0.0885 0.0946 0.1273 0.1540 0.1443
va: 1.2562 1.2641 2.1577 2.0498 2.8783 3.9585 3.9190 3.9279 3.8530 3.9307 3.9229 3.9428 3.8643 3.8038 4.0706 3.6573 4.0781 4.0656 3.9766 3.9782 3.9569 0.9975 1.0177 1.0137 0.9963 1.0049 1.0131 1.0063 1.0160 1.0178 1.0072 0.9988 1.0078 1.0074 0.9980 1.0178 1.0217 1.0352 1.0019 1.0416 1.0111 1.0067
dispcorr: -0.018943730 hartree
energy: -1748.106315020244
dipole: -84.56149 82.67929 -1.88219 32.88673 -32.37026 0.51647 -5.58682 6.95234 1.36552
magnitude: 2.38202 au
magnitude: 6.05462 debye
