program: Orca
programVersion: 5.0.2
elementType: Cl Cl O O N C C C C C C C C C C C C C C C C H H H H H H H H H H H H H H H H H H H H H
charge: 0
multiplicity: 1
keywords: wb97x-d3
keywords: def2-TZVPP
keywords: def2/J RIJCOSX
keywords: DEFGRID2
keywords: scfconv7
keywords: smallprint printgap noloewdin
keywords: NOSOSCF
formula: C16H21Cl2NO2
InChI: InChI=1/C16H21Cl2NO2/c1-12-5-2-3-8-19(12)9-4-10-21-16(20)13-6-7-14(17)15(18)11-13/h6-7,11-12H,2-5,8-10H2,1H3
42 atoms
Cl 3.45115 -1.25638 3.258781
Cl 5.971222 -1.761019 1.452683
O  -0.356132 -0.690032 -0.238286
O  0.489012 -0.925505 -2.290695
N  -4.138963 1.244656 -0.824738
C  -4.219884 2.419873 0.041369
C  -4.000695 3.677531 -0.801391
C  -5.110772 1.253461 -1.901939
C  -4.975565 3.757807 -1.969233
C  -4.915994 2.475034 -2.787243
C  -4.041698 -0.017047 -0.117057
C  -5.502888 2.521279 0.873071
C  -2.62975 -0.300744 0.388589
C  -1.670784 -0.454078 -0.770121
C  0.626955 -0.898645 -1.091124
C  1.936887 -1.108969 -0.420774
C  2.067721 -1.087527 0.963361
C  3.058036 -1.330885 -1.214326
C  3.308506 -1.287292 1.544052
C  4.296267 -1.528965 -0.634648
C  4.426513 -1.509529 0.745921
H  -3.386389 2.35505 0.747338
H  -2.976816 3.668153 -1.187341
H  -4.087676 4.561423 -0.16446
H  -6.153481 1.221002 -1.545328
H  -4.96663 0.349203 -2.497786
H  -4.743304 4.623172 -2.594703
H  -5.994968 3.912177 -1.60236
H  -5.673688 2.479833 -3.574119
H  -3.942636 2.400715 -3.281706
H  -4.742899 -0.095516 0.725465
H  -4.32608 -0.816941 -0.806229
H  -5.647242 1.647328 1.50981
H  -5.451182 3.388588 1.533708
H  -6.400097 2.631921 0.263049
H  -2.292639 0.495886 1.056889
H  -2.651539 -1.220961 0.978275
H  -1.655728 0.446481 -1.385384
H  -1.965949 -1.295428 -1.40266
H  1.213055 -0.918357 1.603348
H  2.972617 -1.348269 -2.292026
H  5.164902 -1.69951 -1.255623
elementType: Cl O N C H
totalener: -1748.08773980 hartree
nucrepener: 1863.70561493 hartree
electener: -3611.79335473 hartree
oneelecener: -6099.45852462 hartree
twoeener: 2487.66516990 hartree
cpcmener: -0.01633146 hartree
kineticenergy: 1743.02052653 hartree
xcener: -123.685881909189 hartree
chargesum: -0.0000000
charge: -0.060057 -0.055255 -0.275034 -0.460789 -0.214837 0.095121 -0.170974 -0.110216 -0.122980 -0.142956 -0.120363 -0.329493 -0.100126 0.022109 0.524064 -0.006245 -0.175837 -0.155014 0.062915 -0.129228 0.045310 0.068199 0.072140 0.073486 0.079497 0.081904 0.075652 0.072283 0.072765 0.059997 0.096204 0.090621 0.092930 0.093662 0.085526 0.071409 0.083014 0.087630 0.097227 0.135276 0.145769 0.144695
qa: -0.0601 -0.0553 -0.2750 -0.4608 -0.2148 0.0951 -0.1710 -0.1102 -0.1230 -0.1430 -0.1204 -0.3295 -0.1001 0.0221 0.5241 -0.0062 -0.1758 -0.1550 0.0629 -0.1292 0.0453 0.0682 0.0721 0.0735 0.0795 0.0819 0.0757 0.0723 0.0728 0.0600 0.0962 0.0906 0.0929 0.0937 0.0855 0.0714 0.0830 0.0876 0.0972 0.1353 0.1458 0.1447
va: 1.2576 1.2646 2.1567 2.0512 2.8850 3.9450 3.9246 3.9387 3.8516 3.9255 3.9283 3.9461 3.8631 3.8066 4.0682 3.6680 4.0992 4.0442 3.9487 3.9965 3.9633 0.9977 1.0162 1.0141 0.9962 1.0053 1.0132 1.0068 1.0156 1.0193 1.0067 0.9985 1.0064 1.0078 0.9979 1.0162 1.0211 1.0348 1.0012 1.0330 1.0217 1.0069
dispcorr: -0.018990024 hartree
energy: -1748.106729823703
dipole: -76.27242 74.97951 -1.29291 29.64518 -29.40543 0.23975 -21.31380 21.56414 0.25035
magnitude: 1.33857 au
magnitude: 3.40237 debye
