program: Orca
programVersion: 5.0.2
elementType: Cl Cl O O N C C C C C C C C C C C C C C C C H H H H H H H H H H H H H H H H H H H H H
charge: 0
multiplicity: 1
keywords: wb97x-d3
keywords: def2-TZVPP
keywords: def2/J RIJCOSX
keywords: DEFGRID2
keywords: scfconv7
keywords: smallprint printgap noloewdin
keywords: NOSOSCF
formula: C16H21Cl2NO2
InChI: InChI=1/C16H21Cl2NO2/c1-12-5-2-3-8-19(12)9-4-10-21-16(20)13-6-7-14(17)15(18)11-13/h6-7,11-12H,2-5,8-10H2,1H3
42 atoms
Cl 3.556433 1.186906 0.020847
Cl 5.657344 -1.147129 -0.026406
O  -0.870495 -1.290716 1.12052
O  -0.466547 -3.474111 1.352262
N  -3.689005 1.511719 -0.52251
C  -4.396556 1.594771 -1.798945
C  -5.268343 2.851391 -1.805853
C  -2.850472 2.667222 -0.255937
C  -4.463062 4.113529 -1.520555
C  -3.671523 3.947289 -0.230355
C  -2.989524 0.25704 -0.321853
C  -3.502795 1.515845 -3.04018
C  -2.969871 -0.152993 1.147779
C  -2.271372 -1.470079 1.391938
C  -0.086011 -2.349624 1.130322
C  1.331506 -2.013006 0.835812
C  1.739579 -0.706238 0.591345
C  2.266639 -3.042757 0.808124
C  3.070569 -0.436107 0.323797
C  3.595147 -2.77268 0.541921
C  4.002585 -1.469055 0.30023
H  -5.068492 0.730454 -1.833032
H  -6.044918 2.742504 -1.042423
H  -5.783764 2.931218 -2.766444
H  -2.033061 2.768838 -0.99031
H  -2.364525 2.531996 0.713075
H  -5.129041 4.97712 -1.453101
H  -3.777966 4.32097 -2.348421
H  -3.008635 4.800853 -0.069349
H  -4.358541 3.913532 0.620913
H  -3.511107 -0.525072 -0.881386
H  -1.965447 0.287348 -0.724221
H  -2.815963 2.358977 -3.126275
H  -2.903189 0.603541 -3.046915
H  -4.115233 1.502728 -3.943745
H  -2.517808 0.621994 1.77286
H  -3.999391 -0.267309 1.49552
H  -2.675544 -2.253484 0.745942
H  -2.395626 -1.78942 2.429068
H  1.033466 0.112338 0.607315
H  1.963115 -4.064144 0.992016
H  4.318919 -3.575909 0.520903
elementType: Cl O N C H
totalener: -1748.08971408 hartree
nucrepener: 1891.38327363 hartree
electener: -3639.47298772 hartree
oneelecener: -6154.57627287 hartree
twoeener: 2515.10328515 hartree
cpcmener: -0.01727109 hartree
kineticenergy: 1743.01005784 hartree
xcener: -123.681166212627 hartree
chargesum: 0.0000000
charge: -0.059780 -0.055199 -0.273123 -0.458624 -0.197999 0.094340 -0.158603 -0.123302 -0.127803 -0.139244 -0.104520 -0.326755 -0.096939 -0.022859 0.525539 -0.003985 -0.170472 -0.164293 0.063936 -0.122155 0.041140 0.058218 0.068808 0.073339 0.079983 0.094778 0.074875 0.072570 0.071949 0.059775 0.087894 0.082082 0.085855 0.092022 0.093912 0.073118 0.065221 0.100287 0.121512 0.133913 0.146015 0.144571
qa: -0.0598 -0.0552 -0.2731 -0.4586 -0.1980 0.0943 -0.1586 -0.1233 -0.1278 -0.1392 -0.1045 -0.3268 -0.0969 -0.0229 0.5255 -0.0040 -0.1705 -0.1643 0.0639 -0.1222 0.0411 0.0582 0.0688 0.0733 0.0800 0.0948 0.0749 0.0726 0.0719 0.0598 0.0879 0.0821 0.0859 0.0920 0.0939 0.0731 0.0652 0.1003 0.1215 0.1339 0.1460 0.1446
va: 1.2583 1.2648 2.1463 2.0549 2.9259 3.9589 3.9012 3.9308 3.8613 3.9250 3.8932 3.9328 3.9040 3.8713 4.0693 3.6516 4.0896 4.0535 3.9536 3.9910 3.9681 1.0044 1.0225 1.0132 1.0032 0.9975 1.0130 1.0072 1.0159 1.0200 1.0022 1.0046 0.9982 1.0030 1.0089 1.0238 1.0297 1.0030 1.0005 1.0325 1.0212 1.0068
dispcorr: -0.018986881 hartree
energy: -1748.108700963551
dipole: -65.93536 65.28413 -0.65123 21.22354 -20.87821 0.34534 -11.35790 11.11969 -0.23821
magnitude: 0.77466 au
magnitude: 1.96902 debye
