program: Orca
programVersion: 5.0.2
elementType: Cl Cl O O N C C C C C C C C C C C C C C C C H H H H H H H H H H H H H H H H H H H H H
charge: 0
multiplicity: 1
keywords: wb97x-d3
keywords: def2-TZVPP
keywords: def2/J RIJCOSX
keywords: DEFGRID2
keywords: scfconv7
keywords: smallprint printgap noloewdin
keywords: NOSOSCF
formula: C16H21Cl2NO2
InChI: InChI=1/C16H21Cl2NO2/c1-12-5-2-3-8-19(12)9-4-10-21-16(20)13-6-7-14(17)15(18)11-13/h6-7,11-12H,2-5,8-10H2,1H3
42 atoms
Cl 3.196509 -0.444976 -2.013961
Cl 4.592621 0.713113 0.551833
O  -1.28264 -2.263752 -0.140821
O  -1.519041 -1.587947 1.984047
N  -2.595558 0.492109 -0.30393
C  -2.718163 1.491047 0.760849
C  -1.404252 2.262639 0.885859
C  -2.261727 1.079462 -1.591137
C  -0.991347 2.910755 -0.429392
C  -0.958559 1.86208 -1.531688
C  -3.752076 -0.384622 -0.382812
C  -3.915905 2.43734 0.625412
C  -3.484608 -1.730284 -1.050267
C  -2.641989 -2.707959 -0.258631
C  -0.87905 -1.666938 0.962806
C  0.499028 -1.123432 0.833616
C  1.153523 -1.077589 -0.391549
C  1.123204 -0.611949 1.966433
C  2.41446 -0.513791 -0.482323
C  2.385153 -0.05589 1.877581
C  3.032726 0.001107 0.652295
H  -2.8589 0.930764 1.691255
H  -0.619859 1.569229 1.203304
H  -1.49732 3.011992 1.676128
H  -3.066929 1.734175 -1.966608
H  -2.160163 0.280447 -2.328648
H  -0.012374 3.384569 -0.32449
H  -1.691118 3.708551 -0.696337
H  -0.774345 2.324418 -2.504636
H  -0.131819 1.169041 -1.349527
H  -4.111243 -0.571071 0.633863
H  -4.58979 0.093614 -0.915482
H  -3.959365 3.105422 1.487836
H  -3.870956 3.063503 -0.266529
H  -4.86184 1.894013 0.5965
H  -4.450227 -2.221362 -1.202789
H  -3.061232 -1.602204 -2.049539
H  -2.585214 -3.661645 -0.783865
H  -3.071972 -2.896321 0.725955
H  0.687695 -1.461891 -1.28788
H  0.626016 -0.640172 2.926153
H  2.867803 0.340834 2.760081
elementType: Cl O N C H
totalener: -1748.08609996 hartree
nucrepener: 2085.66549669 hartree
electener: -3833.75159665 hartree
oneelecener: -6544.14780402 hartree
twoeener: 2710.39620736 hartree
cpcmener: -0.01576869 hartree
kineticenergy: 1743.01846254 hartree
xcener: -123.690302762262 hartree
chargesum: 0.0000000
charge: -0.062823 -0.056581 -0.275728 -0.456761 -0.181135 0.105881 -0.152168 -0.151370 -0.123818 -0.130612 -0.108057 -0.328274 -0.127185 0.012536 0.489049 -0.004892 -0.198344 -0.163778 0.080955 -0.107318 0.040169 0.057566 0.053823 0.080414 0.083119 0.097139 0.073334 0.075440 0.079088 0.053300 0.095892 0.079836 0.094921 0.086585 0.093575 0.085492 0.072900 0.115113 0.097293 0.135834 0.144487 0.145104
qa: -0.0628 -0.0566 -0.2757 -0.4568 -0.1811 0.1059 -0.1522 -0.1514 -0.1238 -0.1306 -0.1081 -0.3283 -0.1272 0.0125 0.4890 -0.0049 -0.1983 -0.1638 0.0810 -0.1073 0.0402 0.0576 0.0538 0.0804 0.0831 0.0971 0.0733 0.0754 0.0791 0.0533 0.0959 0.0798 0.0949 0.0866 0.0936 0.0855 0.0729 0.1151 0.0973 0.1358 0.1445 0.1451
va: 1.2546 1.2638 2.1336 2.0440 2.8406 3.8870 3.9306 3.9552 3.8662 3.9219 3.9029 3.9505 3.8942 3.8327 4.1634 3.4975 4.0420 4.0065 3.9141 3.9783 3.9651 1.0110 1.0294 1.0146 1.0055 0.9981 1.0132 1.0074 1.0170 1.0198 0.9982 1.0044 1.0082 0.9989 1.0023 1.0178 1.0173 0.9984 1.0221 1.0380 1.0230 1.0053
dispcorr: -0.025600886 hartree
energy: -1748.111700849406
dipole: -51.16213 50.07206 -1.09007 12.58623 -12.65817 -0.07194 0.09381 -0.58378 -0.48997
magnitude: 1.19728 au
magnitude: 3.04325 debye
