program: Orca
programVersion: 5.0.2
elementType: Cl Cl O O N C C C C C C C C C C C C C C C C H H H H H H H H H H H H H H H H H H H H H
charge: 0
multiplicity: 1
keywords: wb97x-d3
keywords: def2-TZVPP
keywords: def2/J RIJCOSX
keywords: DEFGRID2
keywords: scfconv7
keywords: smallprint printgap noloewdin
keywords: NOSOSCF
formula: C16H21Cl2NO2
InChI: InChI=1/C16H21Cl2NO2/c1-12-5-2-3-8-19(12)9-4-10-21-16(20)13-6-7-14(17)15(18)11-13/h6-7,11-12H,2-5,8-10H2,1H3
42 atoms
Cl 4.676797 -2.9751 -0.518376
Cl 5.585568 -0.052966 0.208514
O  -0.994791 -0.631915 0.788193
O  -0.549101 -2.714511 0.09588
N  -3.419494 1.660476 -0.376462
C  -4.874708 1.756256 -0.422103
C  -5.352665 2.661974 0.714359
C  -2.743629 2.937436 -0.481701
C  -4.687686 4.032016 0.668823
C  -3.17382 3.869821 0.641134
C  -2.852736 0.608556 -1.192705
C  -5.450574 2.195924 -1.773986
C  -3.025822 -0.773813 -0.568351
C  -2.404773 -0.889045 0.809967
C  -0.187145 -1.608295 0.396857
C  1.237687 -1.179328 0.370989
C  2.18538 -2.123681 -0.001514
C  1.643943 0.11228 0.691113
C  3.526371 -1.788248 -0.054519
C  2.983719 0.449109 0.637445
C  3.929925 -0.494968 0.266442
H  -5.267652 0.755068 -0.218609
H  -5.112563 2.179887 1.66624
H  -6.440233 2.757538 0.673726
H  -2.903985 3.43513 -1.453449
H  -1.668422 2.757891 -0.408094
H  -4.993841 4.629566 1.530041
H  -5.017064 4.585076 -0.215765
H  -2.68098 4.837096 0.522497
H  -2.835962 3.44997 1.592647
H  -3.25432 0.588357 -2.216919
H  -1.784821 0.807828 -1.307572
H  -5.142979 1.532569 -2.582986
H  -6.54073 2.1752 -1.741952
H  -5.153177 3.207234 -2.052289
H  -4.086792 -1.019542 -0.467543
H  -2.612217 -1.530995 -1.23752
H  -2.598901 -1.870875 1.244087
H  -2.812519 -0.123682 1.467733
H  1.873381 -3.128515 -0.25136
H  0.921612 0.86093 0.982515
H  3.305951 1.451198 0.883542
totalener: -1748.06902255 hartree
nucrepener: 1907.83064371 hartree
electener: -3655.89966626 hartree
oneelecener: -6187.51935594 hartree
twoeener: 2531.61968969 hartree
kineticenergy: 1743.05475398 hartree
xcener: -123.690967145464 hartree
chargesum: 0.0000000
charge: -0.042987 -0.040970 -0.279708 -0.369549 -0.172094 0.061438 -0.157133 -0.113574 -0.129451 -0.131571 -0.097200 -0.297407 -0.154284 0.008670 0.461878 -0.033833 -0.147143 -0.188111 0.060885 -0.104525 0.043010 0.062770 0.073585 0.070814 0.078620 0.069856 0.074660 0.070093 0.069557 0.062161 0.085650 0.075054 0.088841 0.087424 0.077760 0.073482 0.102841 0.109243 0.102601 0.131582 0.136820 0.120244
qa: -0.0430 -0.0410 -0.2797 -0.3695 -0.1721 0.0614 -0.1571 -0.1136 -0.1295 -0.1316 -0.0972 -0.2974 -0.1543 0.0087 0.4619 -0.0338 -0.1471 -0.1881 0.0609 -0.1045 0.0430 0.0628 0.0736 0.0708 0.0786 0.0699 0.0747 0.0701 0.0696 0.0622 0.0857 0.0751 0.0888 0.0874 0.0778 0.0735 0.1028 0.1092 0.1026 0.1316 0.1368 0.1202
va: 1.2739 1.2798 2.1277 2.1342 2.8844 3.9776 3.9281 3.9583 3.8734 3.9186 3.8937 3.9510 3.8412 3.8352 4.1422 3.6988 4.0970 4.0659 3.9625 3.9837 4.0033 0.9982 1.0160 1.0150 0.9967 1.0058 1.0145 1.0095 1.0161 1.0196 1.0095 1.0116 1.0089 1.0110 1.0026 1.0166 1.0286 1.0132 1.0230 1.0402 1.0190 1.0164
dispcorr: -0.020266735 hartree
energy: -1748.089289287348
dipole: -74.34391 73.26988 -1.07403 33.72867 -32.55442 1.17425 -3.08156 3.17740 0.09584
magnitude: 1.59424 au
magnitude: 4.05222 debye
