program: Orca
programVersion: 5.0.2
elementType: Cl Cl O O N C C C C C C C C C C C C C C C C H H H H H H H H H H H H H H H H H H H H H
charge: 0
multiplicity: 1
keywords: wb97x-d3
keywords: def2-TZVPP
keywords: def2/J RIJCOSX
keywords: DEFGRID2
keywords: scfconv7
keywords: smallprint printgap noloewdin
keywords: NOSOSCF
formula: C16H21Cl2NO2
InChI: InChI=1/C16H21Cl2NO2/c1-12-5-2-3-8-19(12)9-4-10-21-16(20)13-6-7-14(17)15(18)11-13/h6-7,11-12H,2-5,8-10H2,1H3
42 atoms
Cl 3.476472 1.236368 -0.41508
Cl 5.369627 -1.276363 -0.366078
O  -0.996729 -0.672656 1.360503
O  -0.785861 -2.875766 1.712403
N  -3.041331 1.053586 -0.656531
C  -4.407335 1.5481 -0.763123
C  -4.475571 2.953655 -0.162231
C  -2.056735 1.882675 -1.318833
C  -3.461359 3.895326 -0.802021
C  -2.06643 3.287176 -0.733121
C  -2.891713 -0.371628 -0.845166
C  -4.995104 1.509716 -2.179623
C  -3.205048 -1.159848 0.425678
C  -2.403515 -0.69665 1.627903
C  -0.323787 -1.814479 1.38853
C  1.091191 -1.635533 0.962263
C  1.580712 -0.40954 0.528909
C  1.933154 -2.742219 0.983338
C  2.898004 -0.290341 0.119007
C  3.247918 -2.62397 0.577524
C  3.736787 -1.400388 0.141368
H  -5.03097 0.898895 -0.139211
H  -4.26913 2.881778 0.909471
H  -5.488954 3.34966 -0.264149
H  -2.197554 1.938956 -2.411737
H  -1.073383 1.433167 -1.162769
H  -3.48187 4.86612 -0.302119
H  -3.728202 4.08712 -1.845901
H  -1.343439 3.91243 -1.261684
H  -1.742251 3.231613 0.310169
H  -3.50772 -0.766539 -1.666123
H  -1.860582 -0.57452 -1.142072
H  -6.040731 1.820051 -2.16285
H  -4.471715 2.170563 -2.871003
H  -4.966306 0.506171 -2.605453
H  -4.262578 -1.057846 0.687706
H  -3.043674 -2.224274 0.242214
H  -2.611688 -1.319578 2.499306
H  -2.649449 0.336379 1.864482
H  0.944213 0.463374 0.505787
H  1.553711 -3.697562 1.31788
H  3.905809 -3.481511 0.593256
totalener: -1748.06820613 hartree
nucrepener: 1957.11093063 hartree
electener: -3705.17913677 hartree
oneelecener: -6286.12638496 hartree
twoeener: 2580.94724819 hartree
kineticenergy: 1743.05328135 hartree
xcener: -123.690619732439 hartree
chargesum: -0.0000000
charge: -0.043707 -0.040627 -0.272164 -0.366396 -0.169367 0.061273 -0.156974 -0.112017 -0.124948 -0.136477 -0.105030 -0.295097 -0.145781 0.000282 0.446220 -0.024220 -0.174072 -0.154148 0.060304 -0.102564 0.029446 0.058709 0.073048 0.070656 0.083574 0.066007 0.074389 0.069326 0.071914 0.063667 0.085371 0.078505 0.086554 0.078253 0.085887 0.071637 0.102674 0.110378 0.100804 0.132351 0.139153 0.123205
qa: -0.0437 -0.0406 -0.2722 -0.3664 -0.1694 0.0613 -0.1570 -0.1120 -0.1249 -0.1365 -0.1050 -0.2951 -0.1458 0.0003 0.4462 -0.0242 -0.1741 -0.1541 0.0603 -0.1026 0.0294 0.0587 0.0730 0.0707 0.0836 0.0660 0.0744 0.0693 0.0719 0.0637 0.0854 0.0785 0.0866 0.0783 0.0859 0.0716 0.1027 0.1104 0.1008 0.1324 0.1392 0.1232
va: 1.2771 1.2804 2.1264 2.1392 2.8557 3.9894 3.9258 3.9500 3.8682 3.9234 3.9056 3.9485 3.8083 3.8581 4.1633 3.6932 4.0649 4.0762 3.9839 3.9717 4.0093 0.9973 1.0157 1.0150 0.9980 1.0069 1.0145 1.0093 1.0167 1.0190 1.0119 1.0069 1.0107 1.0033 1.0109 1.0164 1.0271 1.0121 1.0187 1.0293 1.0241 1.0151
dispcorr: -0.021244154 hartree
energy: -1748.089450288420
dipole: -63.70150 62.91246 -0.78905 17.68793 -17.37199 0.31594 -7.40345 7.19069 -0.21275
magnitude: 0.87617 au
magnitude: 2.22704 debye
